{"text_format":"1","workbook":"xlsx","n_sheets":11,"sheets":["Reference","PT","Data PT NL","Fire Range Selector","Tabel 1","Tabel 2","Tabel 3","Tabel 4","Tabel 5","Tabel 6","Disclaimer"],"not_rendered":{"charts":0,"images":15,"macros":1,"external_links":0,"defined_names":9,"comments":0,"pivot_tables":1},"unopened":[],"bounds":{"document_bytes":16777216,"sheet_cells":100000,"rows_first":2000,"rows_last":500,"rows_between":2000,"halvings":0,"cell_chars":16384,"cell_head_chars":4096},"cells_cut":0,"cells_raw":0,"read":"whole","date_system":"1900"}

{"sheet":"Reference","index":0,"n_rows":21,"n_cols":7,"rows_kept":21,"cut":false,"hidden":true,"merged":[[0,1,0,3]]}
["Oplossing","Picture Name",null,null,"Score","Oplossing EE","Oplossing NL"]
["A","A","2A","3A",8,"Täida terve vuuk Soudafoam FR-ga","Vul de hele voeg met Soudafoam FR "]
["B1","B","2B","3B",7,"Pane PU vuuginöör vuugi mitte tulepoolsesse külge ja täida 15 mm paksuselt Soudaseal FR-ga ","Plaats PU rugvulling aan niet-vuurzijde en vul op met 15 mm Soudaseal FR aan niet-vuurzijde"]
["B2","B","2B","3B",7,"Pane PU vuuginöör vuugi mitte tulepoolsesse külge ja täida 20 mm paksuselt Soudaseal FR-ga ","Plaats PU rugvulling aan niet-vuurzijde en vul op met 20 mm Soudaseal FR aan niet-vuurzijde"]
["C1","C","2C","3C",7,"Pane PU vuuginöör vuugi mitte tulepoolsesse külge ja täida 15 mm paksuselt Firecryl FR-ga","Plaats PU rugvulling aan niet-vuurzijde en vul op met 15 mm Firecryl FR aan niet-vuurzijde"]
["C2","C","2C","3C",7,"Pane PU vuuginöör vuugi mitte tulepoolsesse külge ja täida 20 mm paksuselt Firecryl FR-ga","Plaats PU rugvulling aan niet-vuurzijde en vul op met 20 mm Firecryl FR aan niet-vuurzijde"]
["D1","D","2D","3D",7,"Pane PU vuuginöör vuugi mitte tulepoolsesse külge ja täida 15 mm paksuselt Firesilicone B1 FR","Plaats PU rugvulling en vul op met 10 mm Firesilicone B1 FR aan niet-vuurzijde"]
["D2","D","2D","3D",7,"Pane PU vuuginöör vuugi mitte tulepoolsesse külge ja täida 20 mm paksuselt Firesilicone B1 FR","Plaats PU rugvulling en vul op met 15 mm Firesilicone B1 FR aan niet-vuurzijde"]
["E1","E","2E","3E",10,"Täida vuuk Soudafoam FR-ga ja kata vuuk 20 mm paksuselt mitte tulepoolsest küljest Soudaseal FR-ga","Vul voeg op met Soudafoam FR en werk af door 20 mm Soudaseal FR aan te brengen aan niet-vuurzijde"]
["E2","E","2E","3E",10,"Täida vuuk Soudafoam FR-ga ja kata vuuk 25 mm paksuselt mitte tulepoolsest küljest Soudaseal FR-ga","Vul voeg op met Soudafoam FR en werk af door 25 mm Soudaseal FR aan te brengen aan niet-vuurzijde"]
["F1","F","2F","3F",9,"Täida vuuk Soudafoam FR-ga ja kata vuuk 25 mm paksuselt mitte tulepoolsest küljest Firecryl FR-ga","Vul voeg op met Soudafoam FR en werk af door 25 mm Firecryl FR aan te brengen aan niet-vuurzijde"]
["F2","F","2F","3F",9,"Täida vuuk Soudafoam FR-ga ja kata vuuk 20 mm paksuselt mitte tulepoolsest küljest Firecryl FR-ga","Vul voeg op met Soudafoam FR en werk af door 20 mm Firecryl FR aan te brengen aan niet-vuurzijde"]
["G","G","2G","3G",11,"Täida vuuk Soudafoam FR-ga ja kata vuuk 20 mm paksuselt mitte tulepoolsest küljest Firesilicone B1 FR-ga","Vul voeg op met Soudafoam FR en werk af door 20 mm Firesilicone B1 FR aan te brengen aan niet-vuurzijde"]
["H","H","2H","3H",15,"Täida vuuk mineraalvillaga (>80kg/ m3)  ja kata vuuk 30 mm paksuselt mitte tulepoolsest küljest Firesilicone B1 FR-ga","Vul voeg op met minerale wol (>80kg/m3) en werk af met 30 mm Firesilicone B1 FR aan niet-vuurzijde"]
["I","I","2I","3I",10,"Pane vuugi kummalegi küljele PU vuuginöör ja täida 20 mm paksuselt Soudaseal FR-ga mõlemalt poolt","Plaats PU rugvulling aan beide voegzijden en werk af met 20 mm Soudaseal FR aan beide voegzijden"]
{"$rows_left_out":7}
{"sheet":"PT","index":1,"n_rows":155,"n_cols":11,"rows_kept":155,"cut":false,"hidden":true,"merged":[]}
["Bouwelement","(All)"]
["Horizontaal/Verticale voeg","(All)"]
["Min. dikte muur/plafond (mm)","(All)"]
["Max. voegbreedte (mm)","(All)",null,null,null,null,null,null,null,null,"Maksimaalne vuugi laius (mm)"]
["Max. brandweerstand (min.)","(All)",null,null,null,null,null,null,null,null,"Maksimaalne tulekindlus (min)"]
[]
["Row Labels","Count of Nummer"]
[1,1]
[2,1]
[3,1]
[4,1]
[5,1]
[6,1]
[7,1]
[8,1]
{"$rows_left_out":141}
{"sheet":"Data PT NL","index":2,"n_rows":148,"n_cols":13,"rows_kept":148,"cut":false,"hidden":true,"merged":[]}
["Bouwelement","Horizontaal/Verticale voeg","Min. dikte muur/plafond (mm)","Tabel","Max. voegbreedte (mm)","Max. brandweerstand (min.)","Nummer","Opl. 1","Score Opl. 1","Opl. 2","Score Opl. 2","Opl. 3","Score Opl. 3"]
["Muur","Verticaal",200,1,10,240,1,"D1",0,"A",0,"K1",0]
["Muur","Verticaal",200,1,10,180,2,"D1",1,"A",1,"K1",1]
["Muur","Verticaal",200,1,10,120,3,"D1",2,"A",2,"K1",2]
["Muur","Verticaal",200,1,10,90,4,"D1",3,"A",3,"K1",3]
["Muur","Verticaal",200,1,10,60,5,"D2",3,"A",3,"K1",3]
["Muur","Verticaal",200,1,15,240,6,"B1",0,"C1",0,"J1",1]
["Muur","Verticaal",200,1,15,180,7,"B1",1,"C1",1,"J1",2]
["Muur","Verticaal",200,1,15,120,8,"B1",2,"F2",1,"J1",2]
["Muur","Verticaal",200,1,15,90,9,"B1",3,"K2",1,"F2",2]
["Muur","Verticaal",200,1,15,60,10,"B1",1,"C2",1,"A",5]
["Muur","Verticaal",200,1,20,240,11,"J1",0,"E1",2,"I",2]
["Muur","Verticaal",200,1,20,180,12,"J1",1,"A",2,"K2",2]
["Muur","Verticaal",200,1,20,120,13,"A",2,"J1",1,"F2",0]
["Muur","Verticaal",200,1,20,90,14,"A",3,"F2",1,"K2",0]
{"$rows_left_out":134}
{"sheet":"Fire Range Selector","index":3,"n_rows":8,"n_cols":4,"rows_kept":8,"cut":false,"hidden":false,"merged":[[1,1,3,1],[4,1,5,1],[1,0,5,0],[7,0,7,4]]}
["Ehitusdetail","Vertikaalne vuuk / horisontaalne","Minimaalne paksus seina/lagi","Tabel"]
[]
[]
[]
[]
[]
[]
["Palun kliki sinine allajoonitud valik"]

{"sheet":"Tabel 1","index":4,"n_rows":22,"n_cols":8,"rows_kept":22,"cut":false,"hidden":false,"merged":[[14,2,14,4],[15,2,15,4],[3,2,4,4],[0,1,1,1],[7,1,9,1],[0,2,0,4],[21,1,21,7],[7,6,7,7],[1,6,1,7],[10,4,10,5],[11,4,11,5],[7,2,9,3],[10,2,10,3],[11,2,11,3],[7,4,9,5],[5,2,6,4],[3,6,3,7],[4,6,4,7],[13,2,13,4]]}
[null,"Tabel 1","Minimaalselt 200 mm paks sein vertikaalse vuugia"]
[null,null,null,null,null,null,"* Ümarda alati (näiteks\n  16 mm ümarda 20 mm)"]
[null,null,null,null,null,null,"Indeks:"]
[null,null,{"$f":"IF(OR(PT!$B$4=\"(Alle)\",PT!$B$4=\"(All)\"),\"\",PT!$K$4&\": \"&PT!$B$4)","v":""},null,null,null,"Väärtuse võid valida või on valitud"]
[null,null,null,null,null,null,"Väärtus on saadaval, aga pole valitud"]
[null,null,{"$f":"IF(OR(PT!$B$5=\"(Alle)\",PT!$B$5=\"(All)\"),\"\",PT!$K$5&\": \"&PT!$B$5)","v":""},null,null,null,"Väärtus on piirkonnast","väljaspool ja pole saadaval"]
[]
[null,{"$f":"IF($B$11=\"Võimalus 2\",\"Võimalus 1\",\"Lahendus\")","v":"Lahendus"},{"$f":"IF(ISNA(VLOOKUP($C$18,Reference!$A$2:$F$21,2,FALSE)),\" \",IF($C$18=\" \",\"\",VLOOKUP($C$18,Reference!$A$2:$F$21,2,FALSE)))","v":" "},null,{"$f":"IF(ISNA(VLOOKUP($C$18,Reference!$A$2:$F$21,6,FALSE)),\" \",IF($C$18=\" \",\"\",VLOOKUP($C$18,Reference!$A$2:$F$21,6,FALSE)))","v":" "},null,"PU Vuuginöör"]
[null,null,{"$f":"IF(ISNA(VLOOKUP($C$19,Reference!$A$2:$B$21,2,FALSE)),\" \",IF($C$19=\" \",\"\",VLOOKUP($C$19,Reference!$A$2:$B$21,2,FALSE)))","v":" "},null,{"$f":"IF(ISNA(VLOOKUP($C$19,Reference!$A$2:$F$21,4,FALSE)),\" \",IF($C$19=\" \",\"\",VLOOKUP($C$19,Reference!$A$2:$F$21,4,FALSE)))","v":" "},null,"Soudaseal FR","Firecryl FR"]
[null,null,{"$f":"IF(ISNA(VLOOKUP($C$19,Reference!$A$2:$B$21,2,FALSE)),\" \",IF($C$19=\" \",\"\",VLOOKUP($C$19,Reference!$A$2:$B$21,2,FALSE)))","v":" "},null,{"$f":"IF(ISNA(VLOOKUP($C$19,Reference!$A$2:$F$21,4,FALSE)),\" \",IF($C$19=\" \",\"\",VLOOKUP($C$19,Reference!$A$2:$F$21,4,FALSE)))","v":" "},null,"Firesilicone B1 FR","Soudafoam FR"]
[null,{"$f":"IF($C$19=\" \",\" \",IF($C$19=0,\" \",\"Võimalus 2\"))","v":" "},{"$f":"IF(ISNA(VLOOKUP($C$19,Reference!$A$2:$F$21,3,FALSE)),\" \",IF($C$19=\" \",\"\",VLOOKUP($C$19,Reference!$A$2:$F$21,3,FALSE)))","v":" "},null,{"$f":"IF(ISNA(VLOOKUP($C$19,Reference!$A$2:$F$21,6,FALSE)),\" \",IF($C$19=\" \",\"\",VLOOKUP($C$19,Reference!$A$2:$F$21,6,FALSE)))","v":" "}]
[null,{"$f":"IF($C$20=\" \",\" \",IF($C$20=0,\" \",\"Võimalus 3\"))","v":" "},{"$f":"IF(ISNA(VLOOKUP($C$20,Reference!$A$2:$F$21,4,FALSE)),\" \",IF($C$20=\" \",\"\",VLOOKUP($C$20,Reference!$A$2:$F$21,4,FALSE)))","v":" "},null,{"$f":"IF(ISNA(VLOOKUP($C$20,Reference!$A$2:$F$21,6,FALSE)),\" \",IF($C$20=\" \",\"\",VLOOKUP($C$20,Reference!$A$2:$F$21,6,FALSE)))","v":" "}]
[]
[null,"Validiteit = 0",{"$f":"IF(PT!B155=0,\"Geen oplossingen gevonden: selecteer opnieuw\",\" \")","v":" "}]
[null,"Validiteit = 1",{"$f":"IF(PT!B155=1,PT!A155,\" \")","v":" "}]
{"$rows_left_out":8}
{"sheet":"Tabel 2","index":5,"n_rows":22,"n_cols":8,"rows_kept":22,"cut":false,"hidden":false,"merged":[[21,1,21,7],[11,2,11,3],[11,4,11,5],[13,2,13,4],[14,2,14,4],[15,2,15,4],[7,1,9,1],[7,2,9,3],[7,4,9,5],[7,6,7,7],[10,2,10,3],[10,4,10,5],[5,2,6,4],[4,6,4,7],[0,1,1,1],[1,6,1,7],[3,2,4,4],[3,6,3,7],[0,2,0,4]]}
[null,"Tabel 2","Minimaalselt 115 mm paks sein vertikaalse vuugia"]
[null,null,null,null,null,null,"* Ümarda alati (näiteks\n  16 mm ümarda 20 mm)"]
[null,null,null,null,null,null,"Indeks:"]
[null,null,{"$f":"IF(OR(PT!$B$4=\"(Alle)\",PT!$B$4=\"(All)\"),\"\",PT!$K$4&\": \"&PT!$B$4)","v":""},null,null,null,"Väärtuse võid valida või on valitud"]
[null,null,null,null,null,null,"Väärtus on saadaval, aga pole valitud"]
[null,null,{"$f":"IF(OR(PT!$B$5=\"(Alle)\",PT!$B$5=\"(All)\"),\"\",PT!$K$5&\": \"&PT!$B$5)","v":""},null,null,null,"Väärtus on piirkonnast","väljaspool ja pole saadaval"]
[]
[null,{"$f":"IF($B$11=\"Võimalus 2\",\"Võimalus 1\",\"Lahendus\")","v":"Lahendus"},{"$f":"IF(ISNA(VLOOKUP($C$18,Reference!$A$2:$F$21,2,FALSE)),\" \",IF($C$18=\" \",\"\",VLOOKUP($C$18,Reference!$A$2:$F$21,2,FALSE)))","v":" "},null,{"$f":"IF(ISNA(VLOOKUP($C$18,Reference!$A$2:$F$21,6,FALSE)),\" \",IF($C$18=\" \",\"\",VLOOKUP($C$18,Reference!$A$2:$F$21,6,FALSE)))","v":" "},null,"PU Vuuginöör"]
[null,null,{"$f":"IF(ISNA(VLOOKUP($C$19,Reference!$A$2:$B$21,2,FALSE)),\" \",IF($C$19=\" \",\"\",VLOOKUP($C$19,Reference!$A$2:$B$21,2,FALSE)))","v":" "},null,{"$f":"IF(ISNA(VLOOKUP($C$19,Reference!$A$2:$F$21,4,FALSE)),\" \",IF($C$19=\" \",\"\",VLOOKUP($C$19,Reference!$A$2:$F$21,4,FALSE)))","v":" "},null,"Soudaseal FR","Firecryl FR"]
[null,null,{"$f":"IF(ISNA(VLOOKUP($C$19,Reference!$A$2:$B$21,2,FALSE)),\" \",IF($C$19=\" \",\"\",VLOOKUP($C$19,Reference!$A$2:$B$21,2,FALSE)))","v":" "},null,{"$f":"IF(ISNA(VLOOKUP($C$19,Reference!$A$2:$F$21,4,FALSE)),\" \",IF($C$19=\" \",\"\",VLOOKUP($C$19,Reference!$A$2:$F$21,4,FALSE)))","v":" "},null,"Firesilicone B1 FR","Soudafoam FR"]
[null,{"$f":"IF($C$19=\" \",\" \",IF($C$19=0,\" \",\"Võimalus 2\"))","v":" "},{"$f":"IF(ISNA(VLOOKUP($C$19,Reference!$A$2:$F$21,3,FALSE)),\" \",IF($C$19=\" \",\"\",VLOOKUP($C$19,Reference!$A$2:$F$21,3,FALSE)))","v":" "},null,{"$f":"IF(ISNA(VLOOKUP($C$19,Reference!$A$2:$F$21,6,FALSE)),\" \",IF($C$19=\" \",\"\",VLOOKUP($C$19,Reference!$A$2:$F$21,6,FALSE)))","v":" "}]
[null,{"$f":"IF($C$20=\" \",\" \",IF($C$20=0,\" \",\"Võimalus 3\"))","v":" "},{"$f":"IF(ISNA(VLOOKUP($C$20,Reference!$A$2:$F$21,4,FALSE)),\" \",IF($C$20=\" \",\"\",VLOOKUP($C$20,Reference!$A$2:$F$21,4,FALSE)))","v":" "},null,{"$f":"IF(ISNA(VLOOKUP($C$20,Reference!$A$2:$F$21,6,FALSE)),\" \",IF($C$20=\" \",\"\",VLOOKUP($C$20,Reference!$A$2:$F$21,6,FALSE)))","v":" "}]
[]
[null,"Validiteit = 0",{"$f":"IF(PT!B155=0,\"Geen oplossingen gevonden: selecteer opnieuw\",\" \")","v":" "}]
[null,"Validiteit = 1",{"$f":"IF(PT!B155=1,PT!A155,\" \")","v":" "}]
{"$rows_left_out":8}
{"sheet":"Tabel 3","index":6,"n_rows":22,"n_cols":8,"rows_kept":22,"cut":false,"hidden":false,"merged":[[21,1,21,7],[11,2,11,3],[11,4,11,5],[13,2,13,4],[14,2,14,4],[15,2,15,4],[7,1,9,1],[7,2,9,3],[7,4,9,5],[7,6,7,7],[10,2,10,3],[10,4,10,5],[5,2,6,4],[4,6,4,7],[0,1,1,1],[1,6,1,7],[3,2,4,4],[3,6,3,7],[0,2,0,4]]}
[null,"Tabel 3","Minimaalselt 100 mm paks sein vertikaalse vuugia"]
[null,null,null,null,null,null,"* Ümarda alati (näiteks\n  16 mm ümarda 20 mm)"]
[null,null,null,null,null,null,"Indeks:"]
[null,null,{"$f":"IF(OR(PT!$B$4=\"(Alle)\",PT!$B$4=\"(All)\"),\"\",PT!$K$4&\": \"&PT!$B$4)","v":""},null,null,null,"Väärtuse võid valida või on valitud"]
[null,null,null,null,null,null,"Väärtus on saadaval, aga pole valitud"]
[null,null,{"$f":"IF(OR(PT!$B$5=\"(Alle)\",PT!$B$5=\"(All)\"),\"\",PT!$K$5&\": \"&PT!$B$5)","v":""},null,null,null,"Väärtus on piirkonnast","väljaspool ja pole saadaval"]
[]
[null,{"$f":"IF($B$11=\"Võimalus 2\",\"Võimalus 1\",\"Lahendus\")","v":"Lahendus"},{"$f":"IF(ISNA(VLOOKUP($C$18,Reference!$A$2:$F$21,2,FALSE)),\" \",IF($C$18=\" \",\"\",VLOOKUP($C$18,Reference!$A$2:$F$21,2,FALSE)))","v":" "},null,{"$f":"IF(ISNA(VLOOKUP($C$18,Reference!$A$2:$F$21,6,FALSE)),\" \",IF($C$18=\" \",\"\",VLOOKUP($C$18,Reference!$A$2:$F$21,6,FALSE)))","v":" "},null,"PU Vuuginöör"]
[null,null,{"$f":"IF(ISNA(VLOOKUP($C$19,Reference!$A$2:$B$21,2,FALSE)),\" \",IF($C$19=\" \",\"\",VLOOKUP($C$19,Reference!$A$2:$B$21,2,FALSE)))","v":" "},null,{"$f":"IF(ISNA(VLOOKUP($C$19,Reference!$A$2:$F$21,4,FALSE)),\" \",IF($C$19=\" \",\"\",VLOOKUP($C$19,Reference!$A$2:$F$21,4,FALSE)))","v":" "},null,"Soudaseal FR","Firecryl FR"]
[null,null,{"$f":"IF(ISNA(VLOOKUP($C$19,Reference!$A$2:$B$21,2,FALSE)),\" \",IF($C$19=\" \",\"\",VLOOKUP($C$19,Reference!$A$2:$B$21,2,FALSE)))","v":" "},null,{"$f":"IF(ISNA(VLOOKUP($C$19,Reference!$A$2:$F$21,4,FALSE)),\" \",IF($C$19=\" \",\"\",VLOOKUP($C$19,Reference!$A$2:$F$21,4,FALSE)))","v":" "},null,"Firesilicone B1 FR","Soudafoam FR"]
[null,{"$f":"IF($C$19=\" \",\" \",IF($C$19=0,\" \",\"Võimalus 2\"))","v":" "},{"$f":"IF(ISNA(VLOOKUP($C$19,Reference!$A$2:$F$21,3,FALSE)),\" \",IF($C$19=\" \",\"\",VLOOKUP($C$19,Reference!$A$2:$F$21,3,FALSE)))","v":" "},null,{"$f":"IF(ISNA(VLOOKUP($C$19,Reference!$A$2:$F$21,6,FALSE)),\" \",IF($C$19=\" \",\"\",VLOOKUP($C$19,Reference!$A$2:$F$21,6,FALSE)))","v":" "}]
[null,{"$f":"IF($C$20=\" \",\" \",IF($C$20=0,\" \",\"Võimalus 3\"))","v":" "},{"$f":"IF(ISNA(VLOOKUP($C$20,Reference!$A$2:$F$21,4,FALSE)),\" \",IF($C$20=\" \",\"\",VLOOKUP($C$20,Reference!$A$2:$F$21,4,FALSE)))","v":" "},null,{"$f":"IF(ISNA(VLOOKUP($C$20,Reference!$A$2:$F$21,6,FALSE)),\" \",IF($C$20=\" \",\"\",VLOOKUP($C$20,Reference!$A$2:$F$21,6,FALSE)))","v":" "}]
[]
[null,"Validiteit = 0",{"$f":"IF(PT!B155=0,\"Geen oplossingen gevonden: selecteer opnieuw\",\" \")","v":" "}]
[null,"Validiteit = 1",{"$f":"IF(PT!B155=1,PT!A155,\" \")","v":" "}]
{"$rows_left_out":8}
{"sheet":"Tabel 4","index":7,"n_rows":22,"n_cols":8,"rows_kept":22,"cut":false,"hidden":false,"merged":[[21,1,21,7],[11,2,11,3],[11,4,11,5],[13,2,13,4],[14,2,14,4],[15,2,15,4],[7,1,9,1],[7,2,9,3],[7,4,9,5],[7,6,7,7],[10,2,10,3],[10,4,10,5],[5,2,6,4],[6,6,6,7],[0,1,1,1],[1,6,1,7],[3,2,4,4],[3,6,3,7],[4,6,4,7],[0,2,0,4]]}
[null,"Tabel 4","Minimaalselt 200 mm paks sein horisontaalse vuugiga"]
[null,null,null,null,null,null,"* Ümarda alati (näiteks\n  16 mm ümarda 20 mm)"]
[null,null,null,null,null,null,"Indeks:"]
[null,null,{"$f":"IF(OR(PT!$B$4=\"(Alle)\",PT!$B$4=\"(All)\"),\"\",PT!$K$4&\": \"&PT!$B$4)","v":""},null,null,null,"Väärtuse võid valida või on valitud"]
[null,null,null,null,null,null,"Väärtus on saadaval, aga pole valitud"]
[null,null,{"$f":"IF(OR(PT!$B$5=\"(Alle)\",PT!$B$5=\"(All)\"),\"\",PT!$K$5&\": \"&PT!$B$5)","v":""},null,null,null,"Väärtus on piirkonnast","väljaspool ja pole saadaval"]
[]
[null,{"$f":"IF($B$11=\"Võimalus 2\",\"Võimalus 1\",\"Lahendus\")","v":"Lahendus"},{"$f":"IF(ISNA(VLOOKUP($C$18,Reference!$A$2:$F$21,2,FALSE)),\" \",IF($C$18=\" \",\"\",VLOOKUP($C$18,Reference!$A$2:$F$21,2,FALSE)))","v":" "},null,{"$f":"IF(ISNA(VLOOKUP($C$18,Reference!$A$2:$F$21,6,FALSE)),\" \",IF($C$18=\" \",\"\",VLOOKUP($C$18,Reference!$A$2:$F$21,6,FALSE)))","v":" "},null,"PU Vuuginöör"]
[null,null,{"$f":"IF(ISNA(VLOOKUP($C$19,Reference!$A$2:$B$21,2,FALSE)),\" \",IF($C$19=\" \",\"\",VLOOKUP($C$19,Reference!$A$2:$B$21,2,FALSE)))","v":" "},null,{"$f":"IF(ISNA(VLOOKUP($C$19,Reference!$A$2:$F$21,4,FALSE)),\" \",IF($C$19=\" \",\"\",VLOOKUP($C$19,Reference!$A$2:$F$21,4,FALSE)))","v":" "},null,"Soudaseal FR","Firecryl FR"]
[null,null,{"$f":"IF(ISNA(VLOOKUP($C$19,Reference!$A$2:$B$21,2,FALSE)),\" \",IF($C$19=\" \",\"\",VLOOKUP($C$19,Reference!$A$2:$B$21,2,FALSE)))","v":" "},null,{"$f":"IF(ISNA(VLOOKUP($C$19,Reference!$A$2:$F$21,4,FALSE)),\" \",IF($C$19=\" \",\"\",VLOOKUP($C$19,Reference!$A$2:$F$21,4,FALSE)))","v":" "},null,"Firesilicone B1 FR","Soudafoam FR"]
[null,{"$f":"IF($C$19=\" \",\" \",IF($C$19=0,\" \",\"Võimalus 2\"))","v":" "},{"$f":"IF(ISNA(VLOOKUP($C$19,Reference!$A$2:$F$21,3,FALSE)),\" \",IF($C$19=\" \",\"\",VLOOKUP($C$19,Reference!$A$2:$F$21,3,FALSE)))","v":" "},null,{"$f":"IF(ISNA(VLOOKUP($C$19,Reference!$A$2:$F$21,6,FALSE)),\" \",IF($C$19=\" \",\"\",VLOOKUP($C$19,Reference!$A$2:$F$21,6,FALSE)))","v":" "}]
[null,{"$f":"IF($C$20=\" \",\" \",IF($C$20=0,\" \",\"Võimalus 3\"))","v":" "},{"$f":"IF(ISNA(VLOOKUP($C$20,Reference!$A$2:$F$21,4,FALSE)),\" \",IF($C$20=\" \",\"\",VLOOKUP($C$20,Reference!$A$2:$F$21,4,FALSE)))","v":" "},null,{"$f":"IF(ISNA(VLOOKUP($C$20,Reference!$A$2:$F$21,6,FALSE)),\" \",IF($C$20=\" \",\"\",VLOOKUP($C$20,Reference!$A$2:$F$21,6,FALSE)))","v":" "}]
[]
[null,"Validiteit = 0",{"$f":"IF(PT!B155=0,\"Geen oplossingen gevonden: selecteer opnieuw\",\" \")","v":" "}]
[null,"Validiteit = 1",{"$f":"IF(PT!B155=1,PT!A155,\" \")","v":" "}]
{"$rows_left_out":8}
{"sheet":"Tabel 5","index":8,"n_rows":22,"n_cols":8,"rows_kept":22,"cut":false,"hidden":false,"merged":[[21,1,21,7],[11,2,11,3],[11,4,11,5],[13,2,13,4],[14,2,14,4],[15,2,15,4],[7,1,9,1],[7,2,9,3],[7,4,9,5],[7,6,7,7],[10,2,10,3],[10,4,10,5],[5,2,6,4],[6,6,6,7],[0,1,1,1],[1,6,1,7],[3,2,4,4],[3,6,3,7],[0,2,0,4],[4,6,4,7]]}
[null,"Tabel 5","Minimaalselt 115 mm paks sein horisontaalse vuugiga"]
[null,null,null,null,null,null,"* Ümarda alati (näiteks\n  16 mm ümarda 20 mm)"]
[null,null,null,null,null,null,"Indeks:"]
[null,null,{"$f":"IF(OR(PT!$B$4=\"(Alle)\",PT!$B$4=\"(All)\"),\"\",PT!$K$4&\": \"&PT!$B$4)","v":""},null,null,null,"Väärtuse võid valida või on valitud"]
[null,null,null,null,null,null,"Väärtus on saadaval, aga pole valitud"]
[null,null,{"$f":"IF(OR(PT!$B$5=\"(Alle)\",PT!$B$5=\"(All)\"),\"\",PT!$K$5&\": \"&PT!$B$5)","v":""},null,null,null,"Väärtus on piirkonnast","väljaspool ja pole saadaval"]
[]
[null,{"$f":"IF($B$11=\"Võimalus 2\",\"Võimalus 1\",\"Lahendus\")","v":"Lahendus"},{"$f":"IF(ISNA(VLOOKUP($C$18,Reference!$A$2:$F$21,2,FALSE)),\" \",IF($C$18=\" \",\"\",VLOOKUP($C$18,Reference!$A$2:$F$21,2,FALSE)))","v":" "},null,{"$f":"IF(ISNA(VLOOKUP($C$18,Reference!$A$2:$F$21,6,FALSE)),\" \",IF($C$18=\" \",\"\",VLOOKUP($C$18,Reference!$A$2:$F$21,6,FALSE)))","v":" "},null,"PU Vuuginöör"]
[null,null,{"$f":"IF(ISNA(VLOOKUP($C$19,Reference!$A$2:$B$21,2,FALSE)),\" \",IF($C$19=\" \",\"\",VLOOKUP($C$19,Reference!$A$2:$B$21,2,FALSE)))","v":" "},null,{"$f":"IF(ISNA(VLOOKUP($C$19,Reference!$A$2:$F$21,4,FALSE)),\" \",IF($C$19=\" \",\"\",VLOOKUP($C$19,Reference!$A$2:$F$21,4,FALSE)))","v":" "},null,"Soudaseal FR","Firecryl FR"]
[null,null,{"$f":"IF(ISNA(VLOOKUP($C$19,Reference!$A$2:$B$21,2,FALSE)),\" \",IF($C$19=\" \",\"\",VLOOKUP($C$19,Reference!$A$2:$B$21,2,FALSE)))","v":" "},null,{"$f":"IF(ISNA(VLOOKUP($C$19,Reference!$A$2:$F$21,4,FALSE)),\" \",IF($C$19=\" \",\"\",VLOOKUP($C$19,Reference!$A$2:$F$21,4,FALSE)))","v":" "},null,"Firesilicone B1 FR","Soudafoam FR"]
[null,{"$f":"IF($C$19=\" \",\" \",IF($C$19=0,\" \",\"Võimalus 2\"))","v":" "},{"$f":"IF(ISNA(VLOOKUP($C$19,Reference!$A$2:$F$21,3,FALSE)),\" \",IF($C$19=\" \",\"\",VLOOKUP($C$19,Reference!$A$2:$F$21,3,FALSE)))","v":" "},null,{"$f":"IF(ISNA(VLOOKUP($C$19,Reference!$A$2:$F$21,6,FALSE)),\" \",IF($C$19=\" \",\"\",VLOOKUP($C$19,Reference!$A$2:$F$21,6,FALSE)))","v":" "}]
[null,{"$f":"IF($C$20=\" \",\" \",IF($C$20=0,\" \",\"Võimalus 3\"))","v":" "},{"$f":"IF(ISNA(VLOOKUP($C$20,Reference!$A$2:$F$21,4,FALSE)),\" \",IF($C$20=\" \",\"\",VLOOKUP($C$20,Reference!$A$2:$F$21,4,FALSE)))","v":" "},null,{"$f":"IF(ISNA(VLOOKUP($C$20,Reference!$A$2:$F$21,6,FALSE)),\" \",IF($C$20=\" \",\"\",VLOOKUP($C$20,Reference!$A$2:$F$21,6,FALSE)))","v":" "}]
[]
[null,"Validiteit = 0",{"$f":"IF(PT!B155=0,\"Geen oplossingen gevonden: selecteer opnieuw\",\" \")","v":" "}]
[null,"Validiteit = 1",{"$f":"IF(PT!B155=1,PT!A155,\" \")","v":" "}]
{"$rows_left_out":8}
{"sheet":"Tabel 6","index":9,"n_rows":22,"n_cols":8,"rows_kept":22,"cut":false,"hidden":false,"merged":[[21,1,21,7],[11,2,11,3],[11,4,11,5],[13,2,13,4],[14,2,14,4],[15,2,15,4],[7,1,9,1],[7,2,9,3],[7,4,9,5],[7,6,7,7],[10,2,10,3],[10,4,10,5],[5,2,6,4],[4,6,4,7],[6,6,6,7],[0,1,1,1],[1,6,1,7],[3,2,4,4],[3,6,3,7],[0,2,0,4]]}
[null,"Tabel 6","Minimaalselt 150 mm paks lagi horisontaalse vuugiga"]
[null,null,null,null,null,null,"* Ümarda alati (näiteks\n  16 mm ümarda 20 mm)"]
[null,null,null,null,null,null,"Indeks:"]
[null,null,{"$f":"IF(OR(PT!$B$4=\"(Alle)\",PT!$B$4=\"(All)\"),\"\",PT!$K$4&\": \"&PT!$B$4)","v":""},null,null,null,"Väärtuse võid valida või on valitud"]
[null,null,null,null,null,null,"Väärtus on saadaval, aga pole valitud"]
[null,null,{"$f":"IF(OR(PT!$B$5=\"(Alle)\",PT!$B$5=\"(All)\"),\"\",PT!$K$5&\": \"&PT!$B$5)","v":""},null,null,null,"Väärtus on piirkonnast","väljaspool ja pole saadaval"]
[]
[null,{"$f":"IF($B$11=\"Võimalus 2\",\"Võimalus 1\",\"Lahendus\")","v":"Lahendus"},{"$f":"IF(ISNA(VLOOKUP($C$18,Reference!$A$2:$F$21,2,FALSE)),\" \",IF($C$18=\" \",\"\",VLOOKUP($C$18,Reference!$A$2:$F$21,2,FALSE)))","v":" "},null,{"$f":"IF(ISNA(VLOOKUP($C$18,Reference!$A$2:$F$21,6,FALSE)),\" \",IF($C$18=\" \",\"\",VLOOKUP($C$18,Reference!$A$2:$F$21,6,FALSE)))","v":" "},null,"PU Vuuginöör"]
[null,null,{"$f":"IF(ISNA(VLOOKUP($C$19,Reference!$A$2:$B$21,2,FALSE)),\" \",IF($C$19=\" \",\"\",VLOOKUP($C$19,Reference!$A$2:$B$21,2,FALSE)))","v":" "},null,{"$f":"IF(ISNA(VLOOKUP($C$19,Reference!$A$2:$F$21,4,FALSE)),\" \",IF($C$19=\" \",\"\",VLOOKUP($C$19,Reference!$A$2:$F$21,4,FALSE)))","v":" "},null,"Soudaseal FR","Firecryl FR"]
[null,null,{"$f":"IF(ISNA(VLOOKUP($C$19,Reference!$A$2:$B$21,2,FALSE)),\" \",IF($C$19=\" \",\"\",VLOOKUP($C$19,Reference!$A$2:$B$21,2,FALSE)))","v":" "},null,{"$f":"IF(ISNA(VLOOKUP($C$19,Reference!$A$2:$F$21,4,FALSE)),\" \",IF($C$19=\" \",\"\",VLOOKUP($C$19,Reference!$A$2:$F$21,4,FALSE)))","v":" "},null,"Firesilicone B1 FR","Soudafoam FR"]
[null,{"$f":"IF($C$19=\" \",\" \",IF($C$19=0,\" \",\"Võimalus 2\"))","v":" "},{"$f":"IF(ISNA(VLOOKUP($C$19,Reference!$A$2:$F$21,3,FALSE)),\" \",IF($C$19=\" \",\"\",VLOOKUP($C$19,Reference!$A$2:$F$21,3,FALSE)))","v":" "},null,{"$f":"IF(ISNA(VLOOKUP($C$19,Reference!$A$2:$F$21,6,FALSE)),\" \",IF($C$19=\" \",\"\",VLOOKUP($C$19,Reference!$A$2:$F$21,6,FALSE)))","v":" "}]
[null,{"$f":"IF($C$20=\" \",\" \",IF($C$20=0,\" \",\"Võimalus 3\"))","v":" "},{"$f":"IF(ISNA(VLOOKUP($C$20,Reference!$A$2:$F$21,4,FALSE)),\" \",IF($C$20=\" \",\"\",VLOOKUP($C$20,Reference!$A$2:$F$21,4,FALSE)))","v":" "},null,{"$f":"IF(ISNA(VLOOKUP($C$20,Reference!$A$2:$F$21,6,FALSE)),\" \",IF($C$20=\" \",\"\",VLOOKUP($C$20,Reference!$A$2:$F$21,6,FALSE)))","v":" "}]
[]
[null,"Validiteit = 0",{"$f":"IF(PT!B155=0,\"Geen oplossingen gevonden: selecteer opnieuw\",\" \")","v":" "}]
[null,"Validiteit = 1",{"$f":"IF(PT!B155=1,PT!A155,\" \")","v":" "}]
{"$rows_left_out":8}
{"sheet":"Disclaimer","index":10,"n_rows":0,"n_cols":0,"rows_kept":0,"cut":false,"hidden":false,"merged":[]}