{"text_format":"1","workbook":"xlsx","n_sheets":11,"sheets":["Reference","PT","Data PT NL","Fire Range Selector","Tabel 1","Tabel 2","Tabel 3","Tabel 4","Tabel 5","Tabel 6","Disclaimer"],"not_rendered":{"charts":0,"images":15,"macros":1,"external_links":0,"defined_names":9,"comments":0,"pivot_tables":1},"unopened":[],"bounds":{"document_bytes":16777216,"sheet_cells":100000,"rows_first":2000,"rows_last":500,"rows_between":2000,"halvings":0,"cell_chars":16384,"cell_head_chars":4096},"cells_cut":0,"cells_raw":0,"read":"whole","date_system":"1900"}

{"sheet":"Reference","index":0,"n_rows":21,"n_cols":7,"rows_kept":21,"cut":false,"hidden":true,"merged":[[0,1,0,3]]}
["Oplossing","Picture Name",null,null,"Score","Oplossing EE","Oplossing NL"]
["A","A","2A","3A",8,"Täida terve vuuk Soudafoam FR-ga","Vul de hele voeg met Soudafoam FR "]
["B1","B","2B","3B",7,"Pane PU vuuginöör vuugi mitte tulepoolsesse külge ja täida 15 mm paksuselt Soudaseal FR-ga ","Plaats PU rugvulling aan niet-vuurzijde en vul op met 15 mm Soudaseal FR aan niet-vuurzijde"]
["B2","B","2B","3B",7,"Pane PU vuuginöör vuugi mitte tulepoolsesse külge ja täida 20 mm paksuselt Soudaseal FR-ga ","Plaats PU rugvulling aan niet-vuurzijde en vul op met 20 mm Soudaseal FR aan niet-vuurzijde"]
["C1","C","2C","3C",7,"Pane PU vuuginöör vuugi mitte tulepoolsesse külge ja täida 15 mm paksuselt Firecryl FR-ga","Plaats PU rugvulling aan niet-vuurzijde en vul op met 15 mm Firecryl FR aan niet-vuurzijde"]
["C2","C","2C","3C",7,"Pane PU vuuginöör vuugi mitte tulepoolsesse külge ja täida 20 mm paksuselt Firecryl FR-ga","Plaats PU rugvulling aan niet-vuurzijde en vul op met 20 mm Firecryl FR aan niet-vuurzijde"]
["D1","D","2D","3D",7,"Pane PU vuuginöör vuugi mitte tulepoolsesse külge ja täida 15 mm paksuselt Firesilicone B1 FR","Plaats PU rugvulling en vul op met 10 mm Firesilicone B1 FR aan niet-vuurzijde"]
["D2","D","2D","3D",7,"Pane PU vuuginöör vuugi mitte tulepoolsesse külge ja täida 20 mm paksuselt Firesilicone B1 FR","Plaats PU rugvulling en vul op met 15 mm Firesilicone B1 FR aan niet-vuurzijde"]
["E1","E","2E","3E",10,"Täida vuuk Soudafoam FR-ga ja kata vuuk 20 mm paksuselt mitte tulepoolsest küljest Soudaseal FR-ga","Vul voeg op met Soudafoam FR en werk af door 20 mm Soudaseal FR aan te brengen aan niet-vuurzijde"]
["E2","E","2E","3E",10,"Täida vuuk Soudafoam FR-ga ja kata vuuk 25 mm paksuselt mitte tulepoolsest küljest Soudaseal FR-ga","Vul voeg op met Soudafoam FR en werk af door 25 mm Soudaseal FR aan te brengen aan niet-vuurzijde"]
["F1","F","2F","3F",9,"Täida vuuk Soudafoam FR-ga ja kata vuuk 25 mm paksuselt mitte tulepoolsest küljest Firecryl FR-ga","Vul voeg op met Soudafoam FR en werk af door 25 mm Firecryl FR aan te brengen aan niet-vuurzijde"]
["F2","F","2F","3F",9,"Täida vuuk Soudafoam FR-ga ja kata vuuk 20 mm paksuselt mitte tulepoolsest küljest Firecryl FR-ga","Vul voeg op met Soudafoam FR en werk af door 20 mm Firecryl FR aan te brengen aan niet-vuurzijde"]
["G","G","2G","3G",11,"Täida vuuk Soudafoam FR-ga ja kata vuuk 20 mm paksuselt mitte tulepoolsest küljest Firesilicone B1 FR-ga","Vul voeg op met Soudafoam FR en werk af door 20 mm Firesilicone B1 FR aan te brengen aan niet-vuurzijde"]
["H","H","2H","3H",15,"Täida vuuk mineraalvillaga (>80kg/ m3)  ja kata vuuk 30 mm paksuselt mitte tulepoolsest küljest Firesilicone B1 FR-ga","Vul voeg op met minerale wol (>80kg/m3) en werk af met 30 mm Firesilicone B1 FR aan niet-vuurzijde"]
["I","I","2I","3I",10,"Pane vuugi kummalegi küljele PU vuuginöör ja täida 20 mm paksuselt Soudaseal FR-ga mõlemalt poolt","Plaats PU rugvulling aan beide voegzijden en werk af met 20 mm Soudaseal FR aan beide voegzijden"]
["J1","J","2J","3J",10,"Pane vuugi kummalegi küljele PU vuuginöör ja täida 20 mm paksuselt Firecryl FR-ga mõlemalt poolt","Plaats PU rugvulling aan beide voegzijden en werk af met 20 mm Firecryl FR aan beide voegzijden"]
["J2","J","2J","3J",10,"Pane vuugi kummalegi küljele PU vuuginöör ja täida 10 mm paksuselt Firecryl FR-ga mõlemalt poolt","Plaats PU rugvulling aan beide voegzijden en werk af met 10 mm Firecryl FR aan beide voegzijden"]
["K1","K","2K","3K",10,"Pane vuugi kummalegi küljele PU vuuginöör ja täida 10 mm paksuselt Firesilicone B1 FR-ga mõlemalt poolt","Plaats PU rugvulling aan beide voegzijden en werk af met 10 mm Firesilicone B1 FR aan beide voegzijden"]
["K2","K","2K","3K",10,"Pane vuugi kummalegi küljele PU vuuginöör ja täida 20 mm paksuselt Firecryl FR-ga mõlemalt poolt","Plaats PU rugvulling aan beide voegzijden en werk af met 20 mm Firesilicone B1 FR aan beide voegzijden"]
["L","L","2L","3L",12,"Täida vuuk Soudafoam FR-ga ja viimistle  mõlemalt poolt  3 mm paksuselt Firecryl FR-ga","Vul voeg op met Soudafoam FR en werk af door 3 mm Firecryl FR aan te brengen aan beide voegzijden"]
["M","M","2M","3M",14,"Täida vuuk Soudafoam FR-ga ja viimistle  mõlemalt poolt  20 mm paksuselt Firesilicone B1  FR-ga","Vul voeg op met Soudafoam FR en werk af door 20 mm Firesilicone B1 FR aan te brengen aan beide voegzijden"]

{"sheet":"PT","index":1,"n_rows":155,"n_cols":11,"rows_kept":155,"cut":false,"hidden":true,"merged":[]}
["Bouwelement","(All)"]
["Horizontaal/Verticale voeg","(All)"]
["Min. dikte muur/plafond (mm)","(All)"]
["Max. voegbreedte (mm)","(All)",null,null,null,null,null,null,null,null,"Maksimaalne vuugi laius (mm)"]
["Max. brandweerstand (min.)","(All)",null,null,null,null,null,null,null,null,"Maksimaalne tulekindlus (min)"]
[]
["Row Labels","Count of Nummer"]
[1,1]
[2,1]
[3,1]
[4,1]
[5,1]
[6,1]
[7,1]
[8,1]
[9,1]
[10,1]
[11,1]
[12,1]
[13,1]
[14,1]
[15,1]
[16,1]
[17,1]
[18,1]
[19,1]
[20,1]
[21,1]
[22,1]
[23,1]
[24,1]
[25,1]
[26,1]
[27,1]
[28,1]
[29,1]
[30,1]
[31,1]
[32,1]
[33,1]
[34,1]
[35,1]
[36,1]
[37,1]
[38,1]
[39,1]
[40,1]
[41,1]
[42,1]
[43,1]
[44,1]
[45,1]
[46,1]
[47,1]
[48,1]
[49,1]
[50,1]
[51,1]
[52,1]
[53,1]
[54,1]
[55,1]
[56,1]
[57,1]
[58,1]
[59,1]
[60,1]
[61,1]
[62,1]
[63,1]
[64,1]
[65,1]
[66,1]
[67,1]
[68,1]
[69,1]
[70,1]
[71,1]
[72,1]
[73,1]
[74,1]
[75,1]
[76,1]
[77,1]
[78,1]
[79,1]
[80,1]
[81,1]
[82,1]
[83,1]
[84,1]
[85,1]
[86,1]
[87,1]
[88,1]
[89,1]
[90,1]
[91,1]
[92,1]
[93,1]
[94,1]
[95,1]
[96,1]
[97,1]
[98,1]
[99,1]
[100,1]
[101,1]
[102,1]
[103,1]
[104,1]
[105,1]
[106,1]
[107,1]
[108,1]
[109,1]
[110,1]
[111,1]
[112,1]
[113,1]
[114,1]
[115,1]
[116,1]
[117,1]
[118,1]
[119,1]
[120,1]
[121,1]
[122,1]
[123,1]
[124,1]
[125,1]
[126,1]
[127,1]
[128,1]
[129,1]
[130,1]
[131,1]
[132,1]
[133,1]
[134,1]
[135,1]
[136,1]
[137,1]
[138,1]
[139,1]
[140,1]
[141,1]
[142,1]
[143,1]
[144,1]
[145,1]
[146,1]
[147,1]
[{"$f":"MIN(A8:A154)","v":1},{"$f":"SUM(B8:B154)","v":147}]

{"sheet":"Data PT NL","index":2,"n_rows":148,"n_cols":13,"rows_kept":148,"cut":false,"hidden":true,"merged":[]}
["Bouwelement","Horizontaal/Verticale voeg","Min. dikte muur/plafond (mm)","Tabel","Max. voegbreedte (mm)","Max. brandweerstand (min.)","Nummer","Opl. 1","Score Opl. 1","Opl. 2","Score Opl. 2","Opl. 3","Score Opl. 3"]
["Muur","Verticaal",200,1,10,240,1,"D1",0,"A",0,"K1",0]
["Muur","Verticaal",200,1,10,180,2,"D1",1,"A",1,"K1",1]
["Muur","Verticaal",200,1,10,120,3,"D1",2,"A",2,"K1",2]
["Muur","Verticaal",200,1,10,90,4,"D1",3,"A",3,"K1",3]
["Muur","Verticaal",200,1,10,60,5,"D2",3,"A",3,"K1",3]
["Muur","Verticaal",200,1,15,240,6,"B1",0,"C1",0,"J1",1]
["Muur","Verticaal",200,1,15,180,7,"B1",1,"C1",1,"J1",2]
["Muur","Verticaal",200,1,15,120,8,"B1",2,"F2",1,"J1",2]
["Muur","Verticaal",200,1,15,90,9,"B1",3,"K2",1,"F2",2]
["Muur","Verticaal",200,1,15,60,10,"B1",1,"C2",1,"A",5]
["Muur","Verticaal",200,1,20,240,11,"J1",0,"E1",2,"I",2]
["Muur","Verticaal",200,1,20,180,12,"J1",1,"A",2,"K2",2]
["Muur","Verticaal",200,1,20,120,13,"A",2,"J1",1,"F2",0]
["Muur","Verticaal",200,1,20,90,14,"A",3,"F2",1,"K2",0]
["Muur","Verticaal",200,1,20,60,15,"A",4,"J1",4,"B1",0]
["Muur","Verticaal",200,1,25,240,16,"E1",1,"I",1]
["Muur","Verticaal",200,1,25,180,17,"K2",1,"E1",2,"I",2]
["Muur","Verticaal",200,1,25,120,18,"L",0,"I",0,"F1",0]
["Muur","Verticaal",200,1,25,90,19,"L",1,"I",1,"F1",1]
["Muur","Verticaal",200,1,25,60,20,"F2",2,"I",2,"L",2]
["Muur","Verticaal",200,1,30,240,21,"E1",0,"I",0]
["Muur","Verticaal",200,1,30,180,22,"K2",0,"E1",1,"I",1]
["Muur","Verticaal",200,1,30,120,23,"A",0,"K2",1,"E1",2]
["Muur","Verticaal",200,1,30,90,24,"A",1,"K2",2,"E1",3]
["Muur","Verticaal",200,1,30,60,25,"A",2,"K2",3,"L",2]
["Muur","Verticaal",200,1,40,120,26,"G",0]
["Muur","Verticaal",200,1,40,90,27,"A",0,"G",1]
["Muur","Verticaal",200,1,40,60,28,"G",2,"L",1,"M",2]
["Muur","Verticaal",200,1,50,60,29,"L",0,"M",1,"H",4]
["Muur","Verticaal",200,1,60,60,30,"M",0,"H",3]
["Muur","Verticaal",115,2,10,120,31,"K1",0,"E1",3,"J1",3]
["Muur","Verticaal",115,2,10,90,32,"F2",3,"A",0,"K2",2]
["Muur","Verticaal",115,2,10,60,33,"I",6,"C2",2,"D2",3]
["Muur","Verticaal",115,2,15,120,34,"F2",1,"E1",2,"J1",2]
["Muur","Verticaal",115,2,15,90,35,"F2",2,"E1",3,"K2",1]
["Muur","Verticaal",115,2,15,60,36,"I",5,"C2",1,"D2",2]
["Muur","Verticaal",115,2,20,120,37,"F2",0,"E1",1,"J1",1]
["Muur","Verticaal",115,2,20,90,38,"F2",1,"E1",2,"K2",0]
["Muur","Verticaal",115,2,20,60,39,"I",4,"C2",0,"D2",1]
["Muur","Verticaal",115,2,25,120,40,"E1",0,"I",1,"L",1]
["Muur","Verticaal",115,2,25,90,41,"E1",1,"I",2,"L",2]
["Muur","Verticaal",115,2,25,60,42,"D2",0,"E1",2,"F1",3]
["Muur","Verticaal",115,2,30,120,43,"F1",0,"I",0,"L",0]
["Muur","Verticaal",115,2,30,90,44,"F1",1,"I",1,"L",1]
["Muur","Verticaal",115,2,30,60,45,"F2",2,"I",2,"L",2]
["Muur","Verticaal",115,2,40,120,46,"G",0,"H",3]
["Muur","Verticaal",115,2,40,90,47,"G",1,"H",4]
["Muur","Verticaal",115,2,40,60,48,"L",1,"G",2,"M",2]
["Muur","Verticaal",115,2,50,120,49,"H",2]
["Muur","Verticaal",115,2,50,90,50,"H",3]
["Muur","Verticaal",115,2,50,60,51,"L",0,"M",1,"H",4]
["Muur","Verticaal",115,2,60,120,52,"H",1]
["Muur","Verticaal",115,2,60,90,53,"H",2]
["Muur","Verticaal",115,2,60,60,54,"M",0,"H",3]
["Muur","Verticaal",115,2,100,120,55,"H",0]
["Muur","Verticaal",115,2,100,90,56,"H",1]
["Muur","Verticaal",115,2,100,60,57,"H",2]
["Muur","Verticaal",100,3,10,240,58,"J2",0]
["Muur","Verticaal",100,3,10,180,59,"J2",1,"J1",1]
["Muur","Verticaal",100,3,10,120,60,"K1",0,"J2",2,"J1",3]
["Muur","Verticaal",100,3,10,90,61,"A",0,"K1",1,"K2",2]
["Muur","Verticaal",100,3,10,45,62,"A",1,"K1",2,"K2",3]
["Muur","Verticaal",100,3,15,180,63,"J1",1]
["Muur","Verticaal",100,3,15,120,64,"J1",2]
["Muur","Verticaal",100,3,15,90,65,"K2",1,"J1",3]
["Muur","Verticaal",100,3,15,45,66,"K2",2,"A",3,"J1",2]
["Muur","Verticaal",100,3,20,180,67,"J1",0]
["Muur","Verticaal",100,3,20,120,68,"J1",1]
["Muur","Verticaal",100,3,20,90,69,"K2",0,"J1",2]
["Muur","Verticaal",100,3,20,45,70,"K2",1,"J1",3]
["Muur","Verticaal",100,3,25,90,71,"K2",1]
["Muur","Verticaal",100,3,25,45,72,"A",1]
["Muur","Verticaal",100,3,30,90,73,"K2",0]
["Muur","Verticaal",100,3,30,45,74,"A",0]
["Muur","Horizontaal",200,4,10,240,75,"F1",3,"E1",3]
["Muur","Horizontaal",200,4,10,120,76,"F1",4,"E1",4,"L",6]
["Muur","Horizontaal",200,4,10,90,77,"F1",5,"E1",5,"L",7]
["Muur","Horizontaal",200,4,10,60,78,"F1",6,"E1",6,"L",8]
["Muur","Horizontaal",200,4,15,240,79,"F1",2,"E1",2]
["Muur","Horizontaal",200,4,15,120,80,"F1",3,"E1",3,"L",5]
["Muur","Horizontaal",200,4,15,90,81,"F1",4,"E1",4,"L",6]
["Muur","Horizontaal",200,4,15,60,82,"F1",5,"E1",5,"L",7]
["Muur","Horizontaal",200,4,20,240,83,"F1",1,"E1",1]
["Muur","Horizontaal",200,4,20,120,84,"F1",2,"E1",2,"L",4]
["Muur","Horizontaal",200,4,20,90,85,"F1",3,"E1",3,"L",5]
["Muur","Horizontaal",200,4,20,60,86,"F1",4,"E1",4,"L",6]
["Muur","Horizontaal",200,4,25,240,87,"F1",0,"E1",0]
["Muur","Horizontaal",200,4,25,120,88,"F1",1,"E1",1,"L"]
["Muur","Horizontaal",200,4,25,90,89,"F1",2,"E1",2,"L"]
["Muur","Horizontaal",200,4,25,60,90,"F1",3,"E1",3,"L"]
["Muur","Horizontaal",200,4,30,120,91,"L",2]
["Muur","Horizontaal",200,4,30,90,92,"L",3]
["Muur","Horizontaal",200,4,30,60,93,"L",4]
["Muur","Horizontaal",200,4,40,120,94,"L",1]
["Muur","Horizontaal",200,4,40,90,95,"L",2]
["Muur","Horizontaal",200,4,40,60,96,"L",3]
["Muur","Horizontaal",200,4,50,120,97,"L",0]
["Muur","Horizontaal",200,4,50,90,98,"L",1]
["Muur","Horizontaal",200,4,50,60,99,"L",2]
["Muur","Horizontaal",115,5,10,120,100,"L",6]
["Muur","Horizontaal",115,5,10,90,101,"L",7]
["Muur","Horizontaal",115,5,10,60,102,"L",8]
["Muur","Horizontaal",115,5,15,120,103,"L",5]
["Muur","Horizontaal",115,5,15,90,104,"L",6]
["Muur","Horizontaal",115,5,15,60,105,"L",7]
["Muur","Horizontaal",115,5,20,120,106,"L",4]
["Muur","Horizontaal",115,5,20,90,107,"L",5]
["Muur","Horizontaal",115,5,20,60,108,"L",6]
["Muur","Horizontaal",115,5,25,120,109,"L",3]
["Muur","Horizontaal",115,5,25,90,110,"L",4]
["Muur","Horizontaal",115,5,25,60,111,"L",5]
["Muur","Horizontaal",115,5,30,120,112,"L",2]
["Muur","Horizontaal",115,5,30,90,113,"L",3]
["Muur","Horizontaal",115,5,30,60,114,"L",4]
["Muur","Horizontaal",115,5,40,120,115,"L",1]
["Muur","Horizontaal",115,5,40,90,116,"L",2]
["Muur","Horizontaal",115,5,40,60,117,"L",3]
["Muur","Horizontaal",115,5,50,120,118,"L",0]
["Muur","Horizontaal",115,5,50,90,119,"L",1]
["Muur","Horizontaal",115,5,50,60,120,"L",2]
["Plafond","Horizontaal",150,6,10,120,121,"I",4,"C2",2,"D2",3]
["Plafond","Horizontaal",150,6,10,90,122,"I",5,"C2",3,"D2",4]
["Plafond","Horizontaal",150,6,10,60,123,"I",6,"C2",4,"D2",5]
["Plafond","Horizontaal",150,6,15,120,124,"I",3,"C2",1,"D2",2]
["Plafond","Horizontaal",150,6,15,90,125,"I",4,"C2",2,"D2",3]
["Plafond","Horizontaal",150,6,15,60,126,"I",5,"C2",3,"D2",4]
["Plafond","Horizontaal",150,6,20,120,127,"I",2,"C2",0,"D2",1]
["Plafond","Horizontaal",150,6,20,90,128,"I",3,"C2",1,"D2",2]
["Plafond","Horizontaal",150,6,20,60,129,"I",4,"C2",2,"D2",3]
["Plafond","Horizontaal",150,6,25,120,130,"D2",0,"F1",1,"I",1]
["Plafond","Horizontaal",150,6,25,90,131,"B2",1,"D2",1,"A",1]
["Plafond","Horizontaal",150,6,25,60,132,"B2",2,"D2",2,"A",2]
["Plafond","Horizontaal",150,6,30,120,133,"F1",0,"I",0,"E2",1]
["Plafond","Horizontaal",150,6,30,90,134,"B2",0,"A",0,"F1",1]
["Plafond","Horizontaal",150,6,30,60,135,"B2",1,"A",1,"F1",2]
["Plafond","Horizontaal",150,6,40,120,136,"E2",0,"G",0,"L",1]
["Plafond","Horizontaal",150,6,40,90,137,"E2",1,"G",1,"L",2]
["Plafond","Horizontaal",150,6,40,60,138,"E2",2,"G",2,"L",3]
["Plafond","Horizontaal",150,6,50,120,139,"L",0,"M",1,"H",2]
["Plafond","Horizontaal",150,6,50,90,140,"L",1,"M",2,"H",3]
["Plafond","Horizontaal",150,6,50,60,141,"L",2,"M",3,"H",4]
["Plafond","Horizontaal",150,6,60,120,142,"M",1,"H",0]
["Plafond","Horizontaal",150,6,60,90,143,"M",2,"H",1]
["Plafond","Horizontaal",150,6,60,60,144,"M",3,"H",2]
["Plafond","Horizontaal",150,6,100,120,145,"H",0]
["Plafond","Horizontaal",150,6,100,90,146,"H",1]
["Plafond","Horizontaal",150,6,100,60,147,"H",2]

{"sheet":"Fire Range Selector","index":3,"n_rows":8,"n_cols":4,"rows_kept":8,"cut":false,"hidden":false,"merged":[[1,1,3,1],[4,1,5,1],[1,0,5,0],[7,0,7,4]]}
["Ehitusdetail","Vertikaalne vuuk / horisontaalne","Minimaalne paksus seina/lagi","Tabel"]
[]
[]
[]
[]
[]
[]
["Palun kliki sinine allajoonitud valik"]

{"sheet":"Tabel 1","index":4,"n_rows":22,"n_cols":8,"rows_kept":22,"cut":false,"hidden":false,"merged":[[14,2,14,4],[15,2,15,4],[3,2,4,4],[0,1,1,1],[7,1,9,1],[0,2,0,4],[21,1,21,7],[7,6,7,7],[1,6,1,7],[10,4,10,5],[11,4,11,5],[7,2,9,3],[10,2,10,3],[11,2,11,3],[7,4,9,5],[5,2,6,4],[3,6,3,7],[4,6,4,7],[13,2,13,4]]}
[null,"Tabel 1","Minimaalselt 200 mm paks sein vertikaalse vuugia"]
[null,null,null,null,null,null,"* Ümarda alati (näiteks\n  16 mm ümarda 20 mm)"]
[null,null,null,null,null,null,"Indeks:"]
[null,null,{"$f":"IF(OR(PT!$B$4=\"(Alle)\",PT!$B$4=\"(All)\"),\"\",PT!$K$4&\": \"&PT!$B$4)","v":""},null,null,null,"Väärtuse võid valida või on valitud"]
[null,null,null,null,null,null,"Väärtus on saadaval, aga pole valitud"]
[null,null,{"$f":"IF(OR(PT!$B$5=\"(Alle)\",PT!$B$5=\"(All)\"),\"\",PT!$K$5&\": \"&PT!$B$5)","v":""},null,null,null,"Väärtus on piirkonnast","väljaspool ja pole saadaval"]
[]
[null,{"$f":"IF($B$11=\"Võimalus 2\",\"Võimalus 1\",\"Lahendus\")","v":"Lahendus"},{"$f":"IF(ISNA(VLOOKUP($C$18,Reference!$A$2:$F$21,2,FALSE)),\" \",IF($C$18=\" \",\"\",VLOOKUP($C$18,Reference!$A$2:$F$21,2,FALSE)))","v":" "},null,{"$f":"IF(ISNA(VLOOKUP($C$18,Reference!$A$2:$F$21,6,FALSE)),\" \",IF($C$18=\" \",\"\",VLOOKUP($C$18,Reference!$A$2:$F$21,6,FALSE)))","v":" "},null,"PU Vuuginöör"]
[null,null,{"$f":"IF(ISNA(VLOOKUP($C$19,Reference!$A$2:$B$21,2,FALSE)),\" \",IF($C$19=\" \",\"\",VLOOKUP($C$19,Reference!$A$2:$B$21,2,FALSE)))","v":" "},null,{"$f":"IF(ISNA(VLOOKUP($C$19,Reference!$A$2:$F$21,4,FALSE)),\" \",IF($C$19=\" \",\"\",VLOOKUP($C$19,Reference!$A$2:$F$21,4,FALSE)))","v":" "},null,"Soudaseal FR","Firecryl FR"]
[null,null,{"$f":"IF(ISNA(VLOOKUP($C$19,Reference!$A$2:$B$21,2,FALSE)),\" \",IF($C$19=\" \",\"\",VLOOKUP($C$19,Reference!$A$2:$B$21,2,FALSE)))","v":" "},null,{"$f":"IF(ISNA(VLOOKUP($C$19,Reference!$A$2:$F$21,4,FALSE)),\" \",IF($C$19=\" \",\"\",VLOOKUP($C$19,Reference!$A$2:$F$21,4,FALSE)))","v":" "},null,"Firesilicone B1 FR","Soudafoam FR"]
[null,{"$f":"IF($C$19=\" \",\" \",IF($C$19=0,\" \",\"Võimalus 2\"))","v":" "},{"$f":"IF(ISNA(VLOOKUP($C$19,Reference!$A$2:$F$21,3,FALSE)),\" \",IF($C$19=\" \",\"\",VLOOKUP($C$19,Reference!$A$2:$F$21,3,FALSE)))","v":" "},null,{"$f":"IF(ISNA(VLOOKUP($C$19,Reference!$A$2:$F$21,6,FALSE)),\" \",IF($C$19=\" \",\"\",VLOOKUP($C$19,Reference!$A$2:$F$21,6,FALSE)))","v":" "}]
[null,{"$f":"IF($C$20=\" \",\" \",IF($C$20=0,\" \",\"Võimalus 3\"))","v":" "},{"$f":"IF(ISNA(VLOOKUP($C$20,Reference!$A$2:$F$21,4,FALSE)),\" \",IF($C$20=\" \",\"\",VLOOKUP($C$20,Reference!$A$2:$F$21,4,FALSE)))","v":" "},null,{"$f":"IF(ISNA(VLOOKUP($C$20,Reference!$A$2:$F$21,6,FALSE)),\" \",IF($C$20=\" \",\"\",VLOOKUP($C$20,Reference!$A$2:$F$21,6,FALSE)))","v":" "}]
[]
[null,"Validiteit = 0",{"$f":"IF(PT!B155=0,\"Geen oplossingen gevonden: selecteer opnieuw\",\" \")","v":" "}]
[null,"Validiteit = 1",{"$f":"IF(PT!B155=1,PT!A155,\" \")","v":" "}]
[null,"Validiteit > 1",{"$f":"IF(PT!B155>1,\"Teveel oplossingen gevonden: beperk uw selectie\",\" \")","v":"Teveel oplossingen gevonden: beperk uw selectie"}]
[null,null,null,"Afstand cel","Score"]
[null,"Oplossing 1",{"$f":"IF($C$15=\" \",\" \",VLOOKUP($C$15,'Data PT NL'!$G$2:$M$148,2,FALSE))","v":" "},{"$f":"IF($C$15=\" \",\" \",VLOOKUP($C$15,'Data PT NL'!$G$2:$M$148,3,FALSE))","v":" "},{"$f":"IF($C$18=\" \",\" \",VLOOKUP($C$18,Reference!$A$2:$F$21,5,FALSE))","v":" "}]
[null,"Oplossing 2",{"$f":"IF($C$15=\" \",\" \",VLOOKUP($C$15,'Data PT NL'!$G$2:$M$148,4,FALSE))","v":" "},{"$f":"IF($C$15=\" \",\" \",VLOOKUP($C$15,'Data PT NL'!$G$2:$M$148,5,FALSE))","v":" "},{"$f":"IF($C$19=\" \",\" \",VLOOKUP($C$19,Reference!$A$2:$F$21,5,FALSE))","v":" "}]
[null,"Oplossing 3",{"$f":"IF($C$15=\" \",\" \",VLOOKUP($C$15,'Data PT NL'!$G$2:$M$148,6,FALSE))","v":" "},{"$f":"IF($C$15=\" \",\" \",VLOOKUP($C$15,'Data PT NL'!$G$2:$M$148,7,FALSE))","v":" "},{"$f":"IF($C$20=\" \",\" \",VLOOKUP($C$20,Reference!$A$2:$F$21,5,FALSE))","v":" "}]
[]
[null,"Enne Soudali tuletoodete kasutamist soovitame antud lahendus kooskõlastada Soudali esindajatega. Te võite alati kontakteeruda:\n\nSOUDAL AS, Haraka tn. 5, Tallinn 11311, Eesti\ntel.: + 372 655 18 5,  e-mail: info@soudal.ee"]

{"sheet":"Tabel 2","index":5,"n_rows":22,"n_cols":8,"rows_kept":22,"cut":false,"hidden":false,"merged":[[21,1,21,7],[11,2,11,3],[11,4,11,5],[13,2,13,4],[14,2,14,4],[15,2,15,4],[7,1,9,1],[7,2,9,3],[7,4,9,5],[7,6,7,7],[10,2,10,3],[10,4,10,5],[5,2,6,4],[4,6,4,7],[0,1,1,1],[1,6,1,7],[3,2,4,4],[3,6,3,7],[0,2,0,4]]}
[null,"Tabel 2","Minimaalselt 115 mm paks sein vertikaalse vuugia"]
[null,null,null,null,null,null,"* Ümarda alati (näiteks\n  16 mm ümarda 20 mm)"]
[null,null,null,null,null,null,"Indeks:"]
[null,null,{"$f":"IF(OR(PT!$B$4=\"(Alle)\",PT!$B$4=\"(All)\"),\"\",PT!$K$4&\": \"&PT!$B$4)","v":""},null,null,null,"Väärtuse võid valida või on valitud"]
[null,null,null,null,null,null,"Väärtus on saadaval, aga pole valitud"]
[null,null,{"$f":"IF(OR(PT!$B$5=\"(Alle)\",PT!$B$5=\"(All)\"),\"\",PT!$K$5&\": \"&PT!$B$5)","v":""},null,null,null,"Väärtus on piirkonnast","väljaspool ja pole saadaval"]
[]
[null,{"$f":"IF($B$11=\"Võimalus 2\",\"Võimalus 1\",\"Lahendus\")","v":"Lahendus"},{"$f":"IF(ISNA(VLOOKUP($C$18,Reference!$A$2:$F$21,2,FALSE)),\" \",IF($C$18=\" \",\"\",VLOOKUP($C$18,Reference!$A$2:$F$21,2,FALSE)))","v":" "},null,{"$f":"IF(ISNA(VLOOKUP($C$18,Reference!$A$2:$F$21,6,FALSE)),\" \",IF($C$18=\" \",\"\",VLOOKUP($C$18,Reference!$A$2:$F$21,6,FALSE)))","v":" "},null,"PU Vuuginöör"]
[null,null,{"$f":"IF(ISNA(VLOOKUP($C$19,Reference!$A$2:$B$21,2,FALSE)),\" \",IF($C$19=\" \",\"\",VLOOKUP($C$19,Reference!$A$2:$B$21,2,FALSE)))","v":" "},null,{"$f":"IF(ISNA(VLOOKUP($C$19,Reference!$A$2:$F$21,4,FALSE)),\" \",IF($C$19=\" \",\"\",VLOOKUP($C$19,Reference!$A$2:$F$21,4,FALSE)))","v":" "},null,"Soudaseal FR","Firecryl FR"]
[null,null,{"$f":"IF(ISNA(VLOOKUP($C$19,Reference!$A$2:$B$21,2,FALSE)),\" \",IF($C$19=\" \",\"\",VLOOKUP($C$19,Reference!$A$2:$B$21,2,FALSE)))","v":" "},null,{"$f":"IF(ISNA(VLOOKUP($C$19,Reference!$A$2:$F$21,4,FALSE)),\" \",IF($C$19=\" \",\"\",VLOOKUP($C$19,Reference!$A$2:$F$21,4,FALSE)))","v":" "},null,"Firesilicone B1 FR","Soudafoam FR"]
[null,{"$f":"IF($C$19=\" \",\" \",IF($C$19=0,\" \",\"Võimalus 2\"))","v":" "},{"$f":"IF(ISNA(VLOOKUP($C$19,Reference!$A$2:$F$21,3,FALSE)),\" \",IF($C$19=\" \",\"\",VLOOKUP($C$19,Reference!$A$2:$F$21,3,FALSE)))","v":" "},null,{"$f":"IF(ISNA(VLOOKUP($C$19,Reference!$A$2:$F$21,6,FALSE)),\" \",IF($C$19=\" \",\"\",VLOOKUP($C$19,Reference!$A$2:$F$21,6,FALSE)))","v":" "}]
[null,{"$f":"IF($C$20=\" \",\" \",IF($C$20=0,\" \",\"Võimalus 3\"))","v":" "},{"$f":"IF(ISNA(VLOOKUP($C$20,Reference!$A$2:$F$21,4,FALSE)),\" \",IF($C$20=\" \",\"\",VLOOKUP($C$20,Reference!$A$2:$F$21,4,FALSE)))","v":" "},null,{"$f":"IF(ISNA(VLOOKUP($C$20,Reference!$A$2:$F$21,6,FALSE)),\" \",IF($C$20=\" \",\"\",VLOOKUP($C$20,Reference!$A$2:$F$21,6,FALSE)))","v":" "}]
[]
[null,"Validiteit = 0",{"$f":"IF(PT!B155=0,\"Geen oplossingen gevonden: selecteer opnieuw\",\" \")","v":" "}]
[null,"Validiteit = 1",{"$f":"IF(PT!B155=1,PT!A155,\" \")","v":" "}]
[null,"Validiteit > 1",{"$f":"IF(PT!B155>1,\"Teveel oplossingen gevonden: beperk uw selectie\",\" \")","v":"Teveel oplossingen gevonden: beperk uw selectie"}]
[null,null,null,"Afstand cel","Score"]
[null,"Oplossing 1",{"$f":"IF($C$15=\" \",\" \",VLOOKUP($C$15,'Data PT NL'!$G$2:$M$148,2,FALSE))","v":" "},{"$f":"IF($C$15=\" \",\" \",VLOOKUP($C$15,'Data PT NL'!$G$2:$M$148,3,FALSE))","v":" "},{"$f":"IF($C$18=\" \",\" \",VLOOKUP($C$18,Reference!$A$2:$F$21,5,FALSE))","v":" "}]
[null,"Oplossing 2",{"$f":"IF($C$15=\" \",\" \",VLOOKUP($C$15,'Data PT NL'!$G$2:$M$148,4,FALSE))","v":" "},{"$f":"IF($C$15=\" \",\" \",VLOOKUP($C$15,'Data PT NL'!$G$2:$M$148,5,FALSE))","v":" "},{"$f":"IF($C$19=\" \",\" \",VLOOKUP($C$19,Reference!$A$2:$F$21,5,FALSE))","v":" "}]
[null,"Oplossing 3",{"$f":"IF($C$15=\" \",\" \",VLOOKUP($C$15,'Data PT NL'!$G$2:$M$148,6,FALSE))","v":" "},{"$f":"IF($C$15=\" \",\" \",VLOOKUP($C$15,'Data PT NL'!$G$2:$M$148,7,FALSE))","v":" "},{"$f":"IF($C$20=\" \",\" \",VLOOKUP($C$20,Reference!$A$2:$F$21,5,FALSE))","v":" "}]
[]
[null,"Enne Soudali tuletoodete kasutamist soovitame antud lahendus kooskõlastada Soudali esindajatega. Te võite alati kontakteeruda:\n\nSOUDAL AS, Haraka tn. 5, Tallinn 11311, Eesti\ntel.: + 372 655 18 5,  e-mail: info@soudal.ee"]

{"sheet":"Tabel 3","index":6,"n_rows":22,"n_cols":8,"rows_kept":22,"cut":false,"hidden":false,"merged":[[21,1,21,7],[11,2,11,3],[11,4,11,5],[13,2,13,4],[14,2,14,4],[15,2,15,4],[7,1,9,1],[7,2,9,3],[7,4,9,5],[7,6,7,7],[10,2,10,3],[10,4,10,5],[5,2,6,4],[4,6,4,7],[0,1,1,1],[1,6,1,7],[3,2,4,4],[3,6,3,7],[0,2,0,4]]}
[null,"Tabel 3","Minimaalselt 100 mm paks sein vertikaalse vuugia"]
[null,null,null,null,null,null,"* Ümarda alati (näiteks\n  16 mm ümarda 20 mm)"]
[null,null,null,null,null,null,"Indeks:"]
[null,null,{"$f":"IF(OR(PT!$B$4=\"(Alle)\",PT!$B$4=\"(All)\"),\"\",PT!$K$4&\": \"&PT!$B$4)","v":""},null,null,null,"Väärtuse võid valida või on valitud"]
[null,null,null,null,null,null,"Väärtus on saadaval, aga pole valitud"]
[null,null,{"$f":"IF(OR(PT!$B$5=\"(Alle)\",PT!$B$5=\"(All)\"),\"\",PT!$K$5&\": \"&PT!$B$5)","v":""},null,null,null,"Väärtus on piirkonnast","väljaspool ja pole saadaval"]
[]
[null,{"$f":"IF($B$11=\"Võimalus 2\",\"Võimalus 1\",\"Lahendus\")","v":"Lahendus"},{"$f":"IF(ISNA(VLOOKUP($C$18,Reference!$A$2:$F$21,2,FALSE)),\" \",IF($C$18=\" \",\"\",VLOOKUP($C$18,Reference!$A$2:$F$21,2,FALSE)))","v":" "},null,{"$f":"IF(ISNA(VLOOKUP($C$18,Reference!$A$2:$F$21,6,FALSE)),\" \",IF($C$18=\" \",\"\",VLOOKUP($C$18,Reference!$A$2:$F$21,6,FALSE)))","v":" "},null,"PU Vuuginöör"]
[null,null,{"$f":"IF(ISNA(VLOOKUP($C$19,Reference!$A$2:$B$21,2,FALSE)),\" \",IF($C$19=\" \",\"\",VLOOKUP($C$19,Reference!$A$2:$B$21,2,FALSE)))","v":" "},null,{"$f":"IF(ISNA(VLOOKUP($C$19,Reference!$A$2:$F$21,4,FALSE)),\" \",IF($C$19=\" \",\"\",VLOOKUP($C$19,Reference!$A$2:$F$21,4,FALSE)))","v":" "},null,"Soudaseal FR","Firecryl FR"]
[null,null,{"$f":"IF(ISNA(VLOOKUP($C$19,Reference!$A$2:$B$21,2,FALSE)),\" \",IF($C$19=\" \",\"\",VLOOKUP($C$19,Reference!$A$2:$B$21,2,FALSE)))","v":" "},null,{"$f":"IF(ISNA(VLOOKUP($C$19,Reference!$A$2:$F$21,4,FALSE)),\" \",IF($C$19=\" \",\"\",VLOOKUP($C$19,Reference!$A$2:$F$21,4,FALSE)))","v":" "},null,"Firesilicone B1 FR","Soudafoam FR"]
[null,{"$f":"IF($C$19=\" \",\" \",IF($C$19=0,\" \",\"Võimalus 2\"))","v":" "},{"$f":"IF(ISNA(VLOOKUP($C$19,Reference!$A$2:$F$21,3,FALSE)),\" \",IF($C$19=\" \",\"\",VLOOKUP($C$19,Reference!$A$2:$F$21,3,FALSE)))","v":" "},null,{"$f":"IF(ISNA(VLOOKUP($C$19,Reference!$A$2:$F$21,6,FALSE)),\" \",IF($C$19=\" \",\"\",VLOOKUP($C$19,Reference!$A$2:$F$21,6,FALSE)))","v":" "}]
[null,{"$f":"IF($C$20=\" \",\" \",IF($C$20=0,\" \",\"Võimalus 3\"))","v":" "},{"$f":"IF(ISNA(VLOOKUP($C$20,Reference!$A$2:$F$21,4,FALSE)),\" \",IF($C$20=\" \",\"\",VLOOKUP($C$20,Reference!$A$2:$F$21,4,FALSE)))","v":" "},null,{"$f":"IF(ISNA(VLOOKUP($C$20,Reference!$A$2:$F$21,6,FALSE)),\" \",IF($C$20=\" \",\"\",VLOOKUP($C$20,Reference!$A$2:$F$21,6,FALSE)))","v":" "}]
[]
[null,"Validiteit = 0",{"$f":"IF(PT!B155=0,\"Geen oplossingen gevonden: selecteer opnieuw\",\" \")","v":" "}]
[null,"Validiteit = 1",{"$f":"IF(PT!B155=1,PT!A155,\" \")","v":" "}]
[null,"Validiteit > 1",{"$f":"IF(PT!B155>1,\"Teveel oplossingen gevonden: beperk uw selectie\",\" \")","v":"Teveel oplossingen gevonden: beperk uw selectie"}]
[null,null,null,"Afstand cel","Score"]
[null,"Oplossing 1",{"$f":"IF($C$15=\" \",\" \",VLOOKUP($C$15,'Data PT NL'!$G$2:$M$148,2,FALSE))","v":" "},{"$f":"IF($C$15=\" \",\" \",VLOOKUP($C$15,'Data PT NL'!$G$2:$M$148,3,FALSE))","v":" "},{"$f":"IF($C$18=\" \",\" \",VLOOKUP($C$18,Reference!$A$2:$F$21,5,FALSE))","v":" "}]
[null,"Oplossing 2",{"$f":"IF($C$15=\" \",\" \",VLOOKUP($C$15,'Data PT NL'!$G$2:$M$148,4,FALSE))","v":" "},{"$f":"IF($C$15=\" \",\" \",VLOOKUP($C$15,'Data PT NL'!$G$2:$M$148,5,FALSE))","v":" "},{"$f":"IF($C$19=\" \",\" \",VLOOKUP($C$19,Reference!$A$2:$F$21,5,FALSE))","v":" "}]
[null,"Oplossing 3",{"$f":"IF($C$15=\" \",\" \",VLOOKUP($C$15,'Data PT NL'!$G$2:$M$148,6,FALSE))","v":" "},{"$f":"IF($C$15=\" \",\" \",VLOOKUP($C$15,'Data PT NL'!$G$2:$M$148,7,FALSE))","v":" "},{"$f":"IF($C$20=\" \",\" \",VLOOKUP($C$20,Reference!$A$2:$F$21,5,FALSE))","v":" "}]
[]
[null,"Enne Soudali tuletoodete kasutamist soovitame antud lahendus kooskõlastada Soudali esindajatega. Te võite alati kontakteeruda:\n\nSOUDAL AS, Haraka tn. 5, Tallinn 11311, Eesti\ntel.: + 372 655 18 5,  e-mail: info@soudal.ee"]

{"sheet":"Tabel 4","index":7,"n_rows":22,"n_cols":8,"rows_kept":22,"cut":false,"hidden":false,"merged":[[21,1,21,7],[11,2,11,3],[11,4,11,5],[13,2,13,4],[14,2,14,4],[15,2,15,4],[7,1,9,1],[7,2,9,3],[7,4,9,5],[7,6,7,7],[10,2,10,3],[10,4,10,5],[5,2,6,4],[6,6,6,7],[0,1,1,1],[1,6,1,7],[3,2,4,4],[3,6,3,7],[4,6,4,7],[0,2,0,4]]}
[null,"Tabel 4","Minimaalselt 200 mm paks sein horisontaalse vuugiga"]
[null,null,null,null,null,null,"* Ümarda alati (näiteks\n  16 mm ümarda 20 mm)"]
[null,null,null,null,null,null,"Indeks:"]
[null,null,{"$f":"IF(OR(PT!$B$4=\"(Alle)\",PT!$B$4=\"(All)\"),\"\",PT!$K$4&\": \"&PT!$B$4)","v":""},null,null,null,"Väärtuse võid valida või on valitud"]
[null,null,null,null,null,null,"Väärtus on saadaval, aga pole valitud"]
[null,null,{"$f":"IF(OR(PT!$B$5=\"(Alle)\",PT!$B$5=\"(All)\"),\"\",PT!$K$5&\": \"&PT!$B$5)","v":""},null,null,null,"Väärtus on piirkonnast","väljaspool ja pole saadaval"]
[]
[null,{"$f":"IF($B$11=\"Võimalus 2\",\"Võimalus 1\",\"Lahendus\")","v":"Lahendus"},{"$f":"IF(ISNA(VLOOKUP($C$18,Reference!$A$2:$F$21,2,FALSE)),\" \",IF($C$18=\" \",\"\",VLOOKUP($C$18,Reference!$A$2:$F$21,2,FALSE)))","v":" "},null,{"$f":"IF(ISNA(VLOOKUP($C$18,Reference!$A$2:$F$21,6,FALSE)),\" \",IF($C$18=\" \",\"\",VLOOKUP($C$18,Reference!$A$2:$F$21,6,FALSE)))","v":" "},null,"PU Vuuginöör"]
[null,null,{"$f":"IF(ISNA(VLOOKUP($C$19,Reference!$A$2:$B$21,2,FALSE)),\" \",IF($C$19=\" \",\"\",VLOOKUP($C$19,Reference!$A$2:$B$21,2,FALSE)))","v":" "},null,{"$f":"IF(ISNA(VLOOKUP($C$19,Reference!$A$2:$F$21,4,FALSE)),\" \",IF($C$19=\" \",\"\",VLOOKUP($C$19,Reference!$A$2:$F$21,4,FALSE)))","v":" "},null,"Soudaseal FR","Firecryl FR"]
[null,null,{"$f":"IF(ISNA(VLOOKUP($C$19,Reference!$A$2:$B$21,2,FALSE)),\" \",IF($C$19=\" \",\"\",VLOOKUP($C$19,Reference!$A$2:$B$21,2,FALSE)))","v":" "},null,{"$f":"IF(ISNA(VLOOKUP($C$19,Reference!$A$2:$F$21,4,FALSE)),\" \",IF($C$19=\" \",\"\",VLOOKUP($C$19,Reference!$A$2:$F$21,4,FALSE)))","v":" "},null,"Firesilicone B1 FR","Soudafoam FR"]
[null,{"$f":"IF($C$19=\" \",\" \",IF($C$19=0,\" \",\"Võimalus 2\"))","v":" "},{"$f":"IF(ISNA(VLOOKUP($C$19,Reference!$A$2:$F$21,3,FALSE)),\" \",IF($C$19=\" \",\"\",VLOOKUP($C$19,Reference!$A$2:$F$21,3,FALSE)))","v":" "},null,{"$f":"IF(ISNA(VLOOKUP($C$19,Reference!$A$2:$F$21,6,FALSE)),\" \",IF($C$19=\" \",\"\",VLOOKUP($C$19,Reference!$A$2:$F$21,6,FALSE)))","v":" "}]
[null,{"$f":"IF($C$20=\" \",\" \",IF($C$20=0,\" \",\"Võimalus 3\"))","v":" "},{"$f":"IF(ISNA(VLOOKUP($C$20,Reference!$A$2:$F$21,4,FALSE)),\" \",IF($C$20=\" \",\"\",VLOOKUP($C$20,Reference!$A$2:$F$21,4,FALSE)))","v":" "},null,{"$f":"IF(ISNA(VLOOKUP($C$20,Reference!$A$2:$F$21,6,FALSE)),\" \",IF($C$20=\" \",\"\",VLOOKUP($C$20,Reference!$A$2:$F$21,6,FALSE)))","v":" "}]
[]
[null,"Validiteit = 0",{"$f":"IF(PT!B155=0,\"Geen oplossingen gevonden: selecteer opnieuw\",\" \")","v":" "}]
[null,"Validiteit = 1",{"$f":"IF(PT!B155=1,PT!A155,\" \")","v":" "}]
[null,"Validiteit > 1",{"$f":"IF(PT!B155>1,\"Teveel oplossingen gevonden: beperk uw selectie\",\" \")","v":"Teveel oplossingen gevonden: beperk uw selectie"}]
[null,null,null,"Afstand cel","Score"]
[null,"Oplossing 1",{"$f":"IF($C$15=\" \",\" \",VLOOKUP($C$15,'Data PT NL'!$G$2:$M$148,2,FALSE))","v":" "},{"$f":"IF($C$15=\" \",\" \",VLOOKUP($C$15,'Data PT NL'!$G$2:$M$148,3,FALSE))","v":" "},{"$f":"IF($C$18=\" \",\" \",VLOOKUP($C$18,Reference!$A$2:$F$21,5,FALSE))","v":" "}]
[null,"Oplossing 2",{"$f":"IF($C$15=\" \",\" \",VLOOKUP($C$15,'Data PT NL'!$G$2:$M$148,4,FALSE))","v":" "},{"$f":"IF($C$15=\" \",\" \",VLOOKUP($C$15,'Data PT NL'!$G$2:$M$148,5,FALSE))","v":" "},{"$f":"IF($C$19=\" \",\" \",VLOOKUP($C$19,Reference!$A$2:$F$21,5,FALSE))","v":" "}]
[null,"Oplossing 3",{"$f":"IF($C$15=\" \",\" \",VLOOKUP($C$15,'Data PT NL'!$G$2:$M$148,6,FALSE))","v":" "},{"$f":"IF($C$15=\" \",\" \",VLOOKUP($C$15,'Data PT NL'!$G$2:$M$148,7,FALSE))","v":" "},{"$f":"IF($C$20=\" \",\" \",VLOOKUP($C$20,Reference!$A$2:$F$21,5,FALSE))","v":" "}]
[]
[null,"Enne Soudali tuletoodete kasutamist soovitame antud lahendus kooskõlastada Soudali esindajatega. Te võite alati kontakteeruda:\n\nSOUDAL AS, Haraka tn. 5, Tallinn 11311, Eesti\ntel.: + 372 655 18 5,  e-mail: info@soudal.ee"]

{"sheet":"Tabel 5","index":8,"n_rows":22,"n_cols":8,"rows_kept":22,"cut":false,"hidden":false,"merged":[[21,1,21,7],[11,2,11,3],[11,4,11,5],[13,2,13,4],[14,2,14,4],[15,2,15,4],[7,1,9,1],[7,2,9,3],[7,4,9,5],[7,6,7,7],[10,2,10,3],[10,4,10,5],[5,2,6,4],[6,6,6,7],[0,1,1,1],[1,6,1,7],[3,2,4,4],[3,6,3,7],[0,2,0,4],[4,6,4,7]]}
[null,"Tabel 5","Minimaalselt 115 mm paks sein horisontaalse vuugiga"]
[null,null,null,null,null,null,"* Ümarda alati (näiteks\n  16 mm ümarda 20 mm)"]
[null,null,null,null,null,null,"Indeks:"]
[null,null,{"$f":"IF(OR(PT!$B$4=\"(Alle)\",PT!$B$4=\"(All)\"),\"\",PT!$K$4&\": \"&PT!$B$4)","v":""},null,null,null,"Väärtuse võid valida või on valitud"]
[null,null,null,null,null,null,"Väärtus on saadaval, aga pole valitud"]
[null,null,{"$f":"IF(OR(PT!$B$5=\"(Alle)\",PT!$B$5=\"(All)\"),\"\",PT!$K$5&\": \"&PT!$B$5)","v":""},null,null,null,"Väärtus on piirkonnast","väljaspool ja pole saadaval"]
[]
[null,{"$f":"IF($B$11=\"Võimalus 2\",\"Võimalus 1\",\"Lahendus\")","v":"Lahendus"},{"$f":"IF(ISNA(VLOOKUP($C$18,Reference!$A$2:$F$21,2,FALSE)),\" \",IF($C$18=\" \",\"\",VLOOKUP($C$18,Reference!$A$2:$F$21,2,FALSE)))","v":" "},null,{"$f":"IF(ISNA(VLOOKUP($C$18,Reference!$A$2:$F$21,6,FALSE)),\" \",IF($C$18=\" \",\"\",VLOOKUP($C$18,Reference!$A$2:$F$21,6,FALSE)))","v":" "},null,"PU Vuuginöör"]
[null,null,{"$f":"IF(ISNA(VLOOKUP($C$19,Reference!$A$2:$B$21,2,FALSE)),\" \",IF($C$19=\" \",\"\",VLOOKUP($C$19,Reference!$A$2:$B$21,2,FALSE)))","v":" "},null,{"$f":"IF(ISNA(VLOOKUP($C$19,Reference!$A$2:$F$21,4,FALSE)),\" \",IF($C$19=\" \",\"\",VLOOKUP($C$19,Reference!$A$2:$F$21,4,FALSE)))","v":" "},null,"Soudaseal FR","Firecryl FR"]
[null,null,{"$f":"IF(ISNA(VLOOKUP($C$19,Reference!$A$2:$B$21,2,FALSE)),\" \",IF($C$19=\" \",\"\",VLOOKUP($C$19,Reference!$A$2:$B$21,2,FALSE)))","v":" "},null,{"$f":"IF(ISNA(VLOOKUP($C$19,Reference!$A$2:$F$21,4,FALSE)),\" \",IF($C$19=\" \",\"\",VLOOKUP($C$19,Reference!$A$2:$F$21,4,FALSE)))","v":" "},null,"Firesilicone B1 FR","Soudafoam FR"]
[null,{"$f":"IF($C$19=\" \",\" \",IF($C$19=0,\" \",\"Võimalus 2\"))","v":" "},{"$f":"IF(ISNA(VLOOKUP($C$19,Reference!$A$2:$F$21,3,FALSE)),\" \",IF($C$19=\" \",\"\",VLOOKUP($C$19,Reference!$A$2:$F$21,3,FALSE)))","v":" "},null,{"$f":"IF(ISNA(VLOOKUP($C$19,Reference!$A$2:$F$21,6,FALSE)),\" \",IF($C$19=\" \",\"\",VLOOKUP($C$19,Reference!$A$2:$F$21,6,FALSE)))","v":" "}]
[null,{"$f":"IF($C$20=\" \",\" \",IF($C$20=0,\" \",\"Võimalus 3\"))","v":" "},{"$f":"IF(ISNA(VLOOKUP($C$20,Reference!$A$2:$F$21,4,FALSE)),\" \",IF($C$20=\" \",\"\",VLOOKUP($C$20,Reference!$A$2:$F$21,4,FALSE)))","v":" "},null,{"$f":"IF(ISNA(VLOOKUP($C$20,Reference!$A$2:$F$21,6,FALSE)),\" \",IF($C$20=\" \",\"\",VLOOKUP($C$20,Reference!$A$2:$F$21,6,FALSE)))","v":" "}]
[]
[null,"Validiteit = 0",{"$f":"IF(PT!B155=0,\"Geen oplossingen gevonden: selecteer opnieuw\",\" \")","v":" "}]
[null,"Validiteit = 1",{"$f":"IF(PT!B155=1,PT!A155,\" \")","v":" "}]
[null,"Validiteit > 1",{"$f":"IF(PT!B155>1,\"Teveel oplossingen gevonden: beperk uw selectie\",\" \")","v":"Teveel oplossingen gevonden: beperk uw selectie"}]
[null,null,null,"Afstand cel","Score"]
[null,"Oplossing 1",{"$f":"IF($C$15=\" \",\" \",VLOOKUP($C$15,'Data PT NL'!$G$2:$M$148,2,FALSE))","v":" "},{"$f":"IF($C$15=\" \",\" \",VLOOKUP($C$15,'Data PT NL'!$G$2:$M$148,3,FALSE))","v":" "},{"$f":"IF($C$18=\" \",\" \",VLOOKUP($C$18,Reference!$A$2:$F$21,5,FALSE))","v":" "}]
[null,"Oplossing 2",{"$f":"IF($C$15=\" \",\" \",VLOOKUP($C$15,'Data PT NL'!$G$2:$M$148,4,FALSE))","v":" "},{"$f":"IF($C$15=\" \",\" \",VLOOKUP($C$15,'Data PT NL'!$G$2:$M$148,5,FALSE))","v":" "},{"$f":"IF($C$19=\" \",\" \",VLOOKUP($C$19,Reference!$A$2:$F$21,5,FALSE))","v":" "}]
[null,"Oplossing 3",{"$f":"IF($C$15=\" \",\" \",VLOOKUP($C$15,'Data PT NL'!$G$2:$M$148,6,FALSE))","v":" "},{"$f":"IF($C$15=\" \",\" \",VLOOKUP($C$15,'Data PT NL'!$G$2:$M$148,7,FALSE))","v":" "},{"$f":"IF($C$20=\" \",\" \",VLOOKUP($C$20,Reference!$A$2:$F$21,5,FALSE))","v":" "}]
[]
[null,"Enne Soudali tuletoodete kasutamist soovitame antud lahendus kooskõlastada Soudali esindajatega. Te võite alati kontakteeruda:\n\nSOUDAL AS, Haraka tn. 5, Tallinn 11311, Eesti\ntel.: + 372 655 18 5,  e-mail: info@soudal.ee"]

{"sheet":"Tabel 6","index":9,"n_rows":22,"n_cols":8,"rows_kept":22,"cut":false,"hidden":false,"merged":[[21,1,21,7],[11,2,11,3],[11,4,11,5],[13,2,13,4],[14,2,14,4],[15,2,15,4],[7,1,9,1],[7,2,9,3],[7,4,9,5],[7,6,7,7],[10,2,10,3],[10,4,10,5],[5,2,6,4],[4,6,4,7],[6,6,6,7],[0,1,1,1],[1,6,1,7],[3,2,4,4],[3,6,3,7],[0,2,0,4]]}
[null,"Tabel 6","Minimaalselt 150 mm paks lagi horisontaalse vuugiga"]
[null,null,null,null,null,null,"* Ümarda alati (näiteks\n  16 mm ümarda 20 mm)"]
[null,null,null,null,null,null,"Indeks:"]
[null,null,{"$f":"IF(OR(PT!$B$4=\"(Alle)\",PT!$B$4=\"(All)\"),\"\",PT!$K$4&\": \"&PT!$B$4)","v":""},null,null,null,"Väärtuse võid valida või on valitud"]
[null,null,null,null,null,null,"Väärtus on saadaval, aga pole valitud"]
[null,null,{"$f":"IF(OR(PT!$B$5=\"(Alle)\",PT!$B$5=\"(All)\"),\"\",PT!$K$5&\": \"&PT!$B$5)","v":""},null,null,null,"Väärtus on piirkonnast","väljaspool ja pole saadaval"]
[]
[null,{"$f":"IF($B$11=\"Võimalus 2\",\"Võimalus 1\",\"Lahendus\")","v":"Lahendus"},{"$f":"IF(ISNA(VLOOKUP($C$18,Reference!$A$2:$F$21,2,FALSE)),\" \",IF($C$18=\" \",\"\",VLOOKUP($C$18,Reference!$A$2:$F$21,2,FALSE)))","v":" "},null,{"$f":"IF(ISNA(VLOOKUP($C$18,Reference!$A$2:$F$21,6,FALSE)),\" \",IF($C$18=\" \",\"\",VLOOKUP($C$18,Reference!$A$2:$F$21,6,FALSE)))","v":" "},null,"PU Vuuginöör"]
[null,null,{"$f":"IF(ISNA(VLOOKUP($C$19,Reference!$A$2:$B$21,2,FALSE)),\" \",IF($C$19=\" \",\"\",VLOOKUP($C$19,Reference!$A$2:$B$21,2,FALSE)))","v":" "},null,{"$f":"IF(ISNA(VLOOKUP($C$19,Reference!$A$2:$F$21,4,FALSE)),\" \",IF($C$19=\" \",\"\",VLOOKUP($C$19,Reference!$A$2:$F$21,4,FALSE)))","v":" "},null,"Soudaseal FR","Firecryl FR"]
[null,null,{"$f":"IF(ISNA(VLOOKUP($C$19,Reference!$A$2:$B$21,2,FALSE)),\" \",IF($C$19=\" \",\"\",VLOOKUP($C$19,Reference!$A$2:$B$21,2,FALSE)))","v":" "},null,{"$f":"IF(ISNA(VLOOKUP($C$19,Reference!$A$2:$F$21,4,FALSE)),\" \",IF($C$19=\" \",\"\",VLOOKUP($C$19,Reference!$A$2:$F$21,4,FALSE)))","v":" "},null,"Firesilicone B1 FR","Soudafoam FR"]
[null,{"$f":"IF($C$19=\" \",\" \",IF($C$19=0,\" \",\"Võimalus 2\"))","v":" "},{"$f":"IF(ISNA(VLOOKUP($C$19,Reference!$A$2:$F$21,3,FALSE)),\" \",IF($C$19=\" \",\"\",VLOOKUP($C$19,Reference!$A$2:$F$21,3,FALSE)))","v":" "},null,{"$f":"IF(ISNA(VLOOKUP($C$19,Reference!$A$2:$F$21,6,FALSE)),\" \",IF($C$19=\" \",\"\",VLOOKUP($C$19,Reference!$A$2:$F$21,6,FALSE)))","v":" "}]
[null,{"$f":"IF($C$20=\" \",\" \",IF($C$20=0,\" \",\"Võimalus 3\"))","v":" "},{"$f":"IF(ISNA(VLOOKUP($C$20,Reference!$A$2:$F$21,4,FALSE)),\" \",IF($C$20=\" \",\"\",VLOOKUP($C$20,Reference!$A$2:$F$21,4,FALSE)))","v":" "},null,{"$f":"IF(ISNA(VLOOKUP($C$20,Reference!$A$2:$F$21,6,FALSE)),\" \",IF($C$20=\" \",\"\",VLOOKUP($C$20,Reference!$A$2:$F$21,6,FALSE)))","v":" "}]
[]
[null,"Validiteit = 0",{"$f":"IF(PT!B155=0,\"Geen oplossingen gevonden: selecteer opnieuw\",\" \")","v":" "}]
[null,"Validiteit = 1",{"$f":"IF(PT!B155=1,PT!A155,\" \")","v":" "}]
[null,"Validiteit > 1",{"$f":"IF(PT!B155>1,\"Teveel oplossingen gevonden: beperk uw selectie\",\" \")","v":"Teveel oplossingen gevonden: beperk uw selectie"}]
[null,null,null,"Afstand cel","Score"]
[null,"Oplossing 1",{"$f":"IF($C$15=\" \",\" \",VLOOKUP($C$15,'Data PT NL'!$G$2:$M$148,2,FALSE))","v":" "},{"$f":"IF($C$15=\" \",\" \",VLOOKUP($C$15,'Data PT NL'!$G$2:$M$148,3,FALSE))","v":" "},{"$f":"IF($C$18=\" \",\" \",VLOOKUP($C$18,Reference!$A$2:$F$21,5,FALSE))","v":" "}]
[null,"Oplossing 2",{"$f":"IF($C$15=\" \",\" \",VLOOKUP($C$15,'Data PT NL'!$G$2:$M$148,4,FALSE))","v":" "},{"$f":"IF($C$15=\" \",\" \",VLOOKUP($C$15,'Data PT NL'!$G$2:$M$148,5,FALSE))","v":" "},{"$f":"IF($C$19=\" \",\" \",VLOOKUP($C$19,Reference!$A$2:$F$21,5,FALSE))","v":" "}]
[null,"Oplossing 3",{"$f":"IF($C$15=\" \",\" \",VLOOKUP($C$15,'Data PT NL'!$G$2:$M$148,6,FALSE))","v":" "},{"$f":"IF($C$15=\" \",\" \",VLOOKUP($C$15,'Data PT NL'!$G$2:$M$148,7,FALSE))","v":" "},{"$f":"IF($C$20=\" \",\" \",VLOOKUP($C$20,Reference!$A$2:$F$21,5,FALSE))","v":" "}]
[]
[null,"Enne Soudali tuletoodete kasutamist soovitame antud lahendus kooskõlastada Soudali esindajatega. Te võite alati kontakteeruda:\n\nSOUDAL AS, Haraka tn. 5, Tallinn 11311, Eesti\ntel.: + 372 655 18 5,  e-mail: info@soudal.ee"]

{"sheet":"Disclaimer","index":10,"n_rows":0,"n_cols":0,"rows_kept":0,"cut":false,"hidden":false,"merged":[]}